develooper Front page | perl.daily-build.reports | Postings from February 2012

Smoke [5.15.8] v5.15.8-37-g2eb7c4e FAIL(F) Solaris 2.11 (i386/1 cpu)

From:
tony
Date:
February 28, 2012 09:26
Subject:
Smoke [5.15.8] v5.15.8-37-g2eb7c4e FAIL(F) Solaris 2.11 (i386/1 cpu)
Message ID:
201202281725.q1SHPghB014842@mars.tony.develop-help.com
Automated smoke report for 5.15.8 patch 2eb7c4e6ddc7bf8dad1d568547a4d021d70278e8 v5.15.8-37-g2eb7c4e
solaris1164: i86pc (2000MHz) (i386/1 cpu)
    on        Solaris - 2.11
    using     cc version
    smoketime 9 hours 45 minutes (average 48 minutes 46 seconds)

Summary: FAIL(F)

O = OK  F = Failure(s), extended report at the bottom
X = Failure(s) under TEST but not under harness
? = still running or test results not (yet) available
Build failures during:       - = unknown or N/A
c = Configure, m = make, M = make (after miniperl), t = make test-prep

v5.15.8-37-g2eb7c4e  Configuration (common) none
----------- ---------------------------------------------------------
F F F F     
F F F F     -Dusedtrace -Duseshrplib
F F F F     -Dusemorebits
F F F F     -Duseithreads
F F F F     -Duseithreads -Dusedtrace -Duseshrplib
F F F F     -Duseithreads -Dusemorebits
| | | +----- PERLIO = perlio -DDEBUGGING
| | +------- PERLIO = stdio  -DDEBUGGING
| +--------- PERLIO = perlio
+----------- PERLIO = stdio


Locally applied patches:
    uncommitted-changes
    SMOKE2eb7c4e6ddc7bf8dad1d568547a4d021d70278e8

Testsuite was run only with 'harness' and HARNESS_OPTIONS=j2

Failures: (common-args) none
[stdio] 
[stdio] -DDEBUGGING
[stdio/perlio] -Dusedtrace -Duseshrplib
[stdio] -DDEBUGGING -Dusedtrace -Duseshrplib
[stdio] -Dusemorebits
[stdio/perlio] -DDEBUGGING -Dusemorebits
[stdio] -Duseithreads
[perlio] -DDEBUGGING -Duseithreads
[stdio/perlio] -Duseithreads -Dusedtrace -Duseshrplib
[stdio] -DDEBUGGING -Duseithreads -Dusedtrace -Duseshrplib
[stdio/perlio] -Duseithreads -Dusemorebits
[stdio] -DDEBUGGING -Duseithreads -Dusemorebits
../t/op/sigsystem.t.........................................FAILED
    3-4
../cpan/Socket/t/getnameinfo.t..............................FAILED
    10
    Non-zero exit status: 1

[perlio] 
[perlio] -DDEBUGGING
[perlio] -DDEBUGGING -Dusedtrace -Duseshrplib
[perlio] -Dusemorebits
[perlio] -Duseithreads
[stdio] -DDEBUGGING -Duseithreads
[perlio] -DDEBUGGING -Duseithreads -Dusedtrace -Duseshrplib
[perlio] -DDEBUGGING -Duseithreads -Dusemorebits
../cpan/Socket/t/getnameinfo.t..............................FAILED
    10
    Non-zero exit status: 1

Passed Todo tests: (common-args) none
[stdio/perlio] 
[stdio/perlio] -DDEBUGGING
[stdio/perlio] -Dusedtrace -Duseshrplib
[stdio/perlio] -DDEBUGGING -Dusedtrace -Duseshrplib
[stdio/perlio] -Dusemorebits
[stdio/perlio] -DDEBUGGING -Dusemorebits
[stdio/perlio] -Duseithreads
[stdio/perlio] -DDEBUGGING -Duseithreads
[stdio/perlio] -Duseithreads -Dusedtrace -Duseshrplib
[stdio/perlio] -DDEBUGGING -Duseithreads -Dusedtrace -Duseshrplib
[stdio/perlio] -Duseithreads -Dusemorebits
[stdio/perlio] -DDEBUGGING -Duseithreads -Dusemorebits
../cpan/CGI/t/tmpdir.t......................................PASSED
    3-9

Compiler messages(solaris):
"try.c", line 31: warning: implicit function declaration: sysctl
"try.c", line 25: warning: implicit function declaration: _NSGetExecutablePath
"pp.c", line 681: warning: statement not reached
"./const-xs.inc", line 31: warning: initializer does not fit or is out of range: 0x80000000
"bzlib.c", line 866: warning: statement not reached
"util.c", line 5864: warning: statement not reached

-- 
Report by Test::Smoke v1.44 build 1285 running on perl 5.12.3
(Reporter v0.035 / Smoker v0.045)

Logs at http://perl.develop-help.com/reports/
Branch: origin/smoke-me/portabilify-podhtml
Configuration: default




nntp.perl.org: Perl Programming lists via nntp and http.
Comments to Ask Bjørn Hansen at ask@perl.org | Group listing | About