develooper Front page | perl.daily-build.reports | Postings from February 2012

Smoke [5.15.8] v5.15.8-25-g1f629e5 FAIL(F) cygwin_nt-5.2-wow64 1.7.11(0.260/5/3) (AMD64/2 cpu)

From:
tony
Date:
February 28, 2012 03:01
Subject:
Smoke [5.15.8] v5.15.8-25-g1f629e5 FAIL(F) cygwin_nt-5.2-wow64 1.7.11(0.260/5/3) (AMD64/2 cpu)
Message ID:
201202281100.q1SB0moY021776@mars.tony.develop-help.com
Automated smoke report for 5.15.8 patch 1f629e57df116eb70c42f5e4306c2a1eb93b4c93 v5.15.8-25-g1f629e5
pluto: AMD Athlon(tm) 64 X2 Dual Core Processor 5200+(~2613 MHz) (AMD64/2 cpu)
    on        cygwin_nt-5.2-wow64 - 1.7.11(0.260/5/3)
    using     ccache gcc version 4.5.3
    smoketime 4 hours (average 1 hour)

Summary: FAIL(F)

O = OK  F = Failure(s), extended report at the bottom
X = Failure(s) under TEST but not under harness
? = still running or test results not (yet) available
Build failures during:       - = unknown or N/A
c = Configure, m = make, M = make (after miniperl), t = make test-prep

v5.15.8-25-g1f629e5  Configuration (common) -Dcc='ccache gcc'
----------- ---------------------------------------------------------
F F F F     -Uusethreads -Uuseithreads
F F F F     -Duseithreads -Uusemymalloc
| | | +----- PERLIO = perlio -DDEBUGGING
| | +------- PERLIO = stdio  -DDEBUGGING
| +--------- PERLIO = perlio
+----------- PERLIO = stdio


Locally applied patches:
    uncommitted-changes
    SMOKE1f629e57df116eb70c42f5e4306c2a1eb93b4c93

Testsuite was run only with 'harness' and HARNESS_OPTIONS=j3

Failures: (common-args) -Dcc='ccache gcc'
[stdio] -Uusethreads -Uuseithreads
../t/io/shm.t...............................................FAILED
    Non-zero exit status: 88
    No plan found in TAP output
../t/op/sigdispatch.t.......................................FAILED
    Bad plan.  You planned 26 tests but ran 0.
../t/op/taint.t.............................................FAILED
    Bad plan.  You planned 791 tests but ran 537.
../cpan/Win32/t/Unicode.t...................................FAILED
    4
../cpan/Win32API-File/t/file.t..............................FAILED
    Non-zero exit status: 2
    Bad plan.  You planned 267 tests but ran 45.
../dist/Net-Ping/t/500_ping_icmp.t..........................FAILED
    2
    Non-zero exit status: 1
../dist/Net-Ping/t/510_ping_udp.t...........................FAILED
    2
    Non-zero exit status: 1
../ext/XS-APItest/t/call_checker.t..........................FAILED
    Non-zero exit status: 255
    Bad plan.  You planned 64 tests but ran 0.

[perlio] -Uusethreads -Uuseithreads
../t/io/shm.t...............................................FAILED
    Non-zero exit status: 88
    No plan found in TAP output
../t/op/sigdispatch.t.......................................FAILED
    Bad plan.  You planned 26 tests but ran 0.
../t/op/taint.t.............................................FAILED
    Bad plan.  You planned 791 tests but ran 537.
../cpan/Time-HiRes/t/alarm.t................................FAILED
    5
    Non-zero exit status: 1
../dist/Net-Ping/t/500_ping_icmp.t..........................FAILED
    2
    Non-zero exit status: 1
../dist/Net-Ping/t/510_ping_udp.t...........................FAILED
    2
    Non-zero exit status: 1
../ext/XS-APItest/t/call_checker.t..........................FAILED
    Non-zero exit status: 255
    Bad plan.  You planned 64 tests but ran 0.
../cpan/Win32/t/Unicode.t...................................FAILED
    4
../cpan/Win32API-File/t/file.t..............................FAILED
    Non-zero exit status: 2
    Bad plan.  You planned 267 tests but ran 45.
../ext/Win32CORE/t/win32core.t..............................FAILED
    3
    Non-zero exit status: 1

[stdio] -DDEBUGGING -Uusethreads -Uuseithreads
../t/io/shm.t...............................................FAILED
    Non-zero exit status: 88
    No plan found in TAP output
../t/op/alarm.t.............................................FAILED
    1-2
../t/op/sigdispatch.t.......................................FAILED
    Bad plan.  You planned 26 tests but ran 0.
../t/op/taint.t.............................................FAILED
    Bad plan.  You planned 791 tests but ran 537.
../cpan/Win32/t/Unicode.t...................................FAILED
    4
../cpan/Win32API-File/t/file.t..............................FAILED
    Non-zero exit status: 2
    Bad plan.  You planned 267 tests but ran 45.
../dist/I18N-Collate/t/I18N-Collate.t.......................FAILED
    6-7
    Non-zero exit status: 2
../dist/Net-Ping/t/500_ping_icmp.t..........................FAILED
    2
    Non-zero exit status: 1
../dist/Net-Ping/t/510_ping_udp.t...........................FAILED
    2
    Non-zero exit status: 1
../ext/XS-APItest/t/call_checker.t..........................FAILED
    Non-zero exit status: 255
    Bad plan.  You planned 64 tests but ran 0.

[perlio] -DDEBUGGING -Uusethreads -Uuseithreads
../t/io/shm.t...............................................FAILED
    Non-zero exit status: 88
    No plan found in TAP output
../t/op/sigdispatch.t.......................................FAILED
    Bad plan.  You planned 26 tests but ran 0.
../t/op/taint.t.............................................FAILED
    Bad plan.  You planned 791 tests but ran 537.
../dist/Net-Ping/t/500_ping_icmp.t..........................FAILED
    2
    Non-zero exit status: 1
../dist/Net-Ping/t/510_ping_udp.t...........................FAILED
    2
    Non-zero exit status: 1
../ext/XS-APItest/t/call_checker.t..........................FAILED
    Non-zero exit status: 255
    Bad plan.  You planned 64 tests but ran 0.
../cpan/Win32/t/Unicode.t...................................FAILED
    4
../cpan/Win32API-File/t/file.t..............................FAILED
    Non-zero exit status: 2
    Bad plan.  You planned 267 tests but ran 45.
../ext/Win32CORE/t/win32core.t..............................FAILED
    3
    Non-zero exit status: 1
../dist/I18N-Collate/t/I18N-Collate.t.......................FAILED
    6-7
    Non-zero exit status: 2

[stdio] -Duseithreads -Uusemymalloc
[stdio] -DDEBUGGING -Duseithreads -Uusemymalloc
../t/io/shm.t...............................................FAILED
    Non-zero exit status: 88
    No plan found in TAP output
../t/op/taint.t.............................................FAILED
    Bad plan.  You planned 791 tests but ran 537.
../cpan/Win32/t/Unicode.t...................................FAILED
    4
../cpan/Win32API-File/t/file.t..............................FAILED
    Non-zero exit status: 2
    Bad plan.  You planned 267 tests but ran 45.
../dist/Net-Ping/t/500_ping_icmp.t..........................FAILED
    2
    Non-zero exit status: 1
../dist/Net-Ping/t/510_ping_udp.t...........................FAILED
    2
    Non-zero exit status: 1
../ext/XS-APItest/t/call_checker.t..........................FAILED
    Non-zero exit status: 255
    Bad plan.  You planned 64 tests but ran 0.

[perlio] -Duseithreads -Uusemymalloc
../t/io/shm.t...............................................FAILED
    Non-zero exit status: 88
    No plan found in TAP output
../t/op/taint.t.............................................FAILED
    Bad plan.  You planned 791 tests but ran 537.
../cpan/Time-HiRes/t/alarm.t................................FAILED
    6, 9
    Non-zero exit status: 2
../ext/XS-APItest/t/call_checker.t..........................FAILED
    Non-zero exit status: 255
    Bad plan.  You planned 64 tests but ran 0.
../dist/Net-Ping/t/500_ping_icmp.t..........................FAILED
    2
    Non-zero exit status: 1
../dist/Net-Ping/t/510_ping_udp.t...........................FAILED
    2
    Non-zero exit status: 1
../cpan/Win32/t/Unicode.t...................................FAILED
    4
../cpan/Win32API-File/t/file.t..............................FAILED
    Non-zero exit status: 2
    Bad plan.  You planned 267 tests but ran 45.

[perlio] -DDEBUGGING -Duseithreads -Uusemymalloc
../t/io/shm.t...............................................FAILED
    Non-zero exit status: 88
    No plan found in TAP output
../t/op/taint.t.............................................FAILED
    Bad plan.  You planned 791 tests but ran 537.
../ext/XS-APItest/t/call_checker.t..........................FAILED
    Non-zero exit status: 255
    Bad plan.  You planned 64 tests but ran 0.
../dist/Net-Ping/t/500_ping_icmp.t..........................FAILED
    2
    Non-zero exit status: 1
../dist/Net-Ping/t/510_ping_udp.t...........................FAILED
    2
    Non-zero exit status: 1
../cpan/Win32/t/Unicode.t...................................FAILED
    4
../cpan/Win32API-File/t/file.t..............................FAILED
    Non-zero exit status: 2
    Bad plan.  You planned 267 tests but ran 45.

Passed Todo tests: (common-args) -Dcc='ccache gcc'
[stdio] -Uusethreads -Uuseithreads
[stdio] -DDEBUGGING -Uusethreads -Uuseithreads
[stdio] -Duseithreads -Uusemymalloc
[stdio] -DDEBUGGING -Duseithreads -Uusemymalloc
../t/io/tell.t..............................................PASSED
    28
../cpan/CGI/t/tmpdir.t......................................PASSED
    3-9
../lib/File/Compare.t.......................................PASSED
    13
../lib/File/Copy.t..........................................PASSED
    77-78, 83-84, 89-90, 95-96, 101-102, 107-108
    113-114, 119-120, 125-126, 131-132, 137-138
    143-144, 149-150, 155-156, 161-162, 167-168
    173-174, 179-180, 185-186, 191-192, 197-198
    203-204, 209-210, 215-216, 221-222, 227-228
    233-234, 239-240, 245-246, 251-252, 257-258
    263-264, 269-270, 275-276, 281-282, 287-288
    293-294, 299-300, 305-306, 311-312, 317-318
    323-324, 329-330, 335-336, 341-342, 347-348
    353-354, 359-360, 365-366, 371-372, 377-378
    383-384, 389-390, 395-396, 401-402, 407-408

[perlio] -Uusethreads -Uuseithreads
../lib/File/Compare.t.......................................PASSED
    13
../lib/File/Copy.t..........................................PASSED
    77-78, 83-84, 89-90, 95-96, 101-102, 107-108
    113-114, 119-120, 125-126, 131-132, 137-138
    143-144, 149-150, 155-156, 161-162, 167-168
    173-174, 179-180, 185-186, 191-192, 197-198
    203-204, 209-210, 215-216, 221-222, 227-228
    233-234, 239-240, 245-246, 251-252, 257-258
    263-264, 269-270, 275-276, 281-282, 287-288
    293-294, 299-300, 305-306, 311-312, 317-318
    323-324, 329-330, 335-336, 341-342, 347-348
    353-354, 359-360, 365-366, 371-372, 377-378
    383-384, 389-390, 395-396, 401-402, 407-408
../cpan/CGI/t/tmpdir.t......................................PASSED
    3-9

[perlio] -DDEBUGGING -Uusethreads -Uuseithreads
[perlio] -Duseithreads -Uusemymalloc
[perlio] -DDEBUGGING -Duseithreads -Uusemymalloc
../cpan/CGI/t/tmpdir.t......................................PASSED
    3-9
../lib/File/Compare.t.......................................PASSED
    13
../lib/File/Copy.t..........................................PASSED
    77-78, 83-84, 89-90, 95-96, 101-102, 107-108
    113-114, 119-120, 125-126, 131-132, 137-138
    143-144, 149-150, 155-156, 161-162, 167-168
    173-174, 179-180, 185-186, 191-192, 197-198
    203-204, 209-210, 215-216, 221-222, 227-228
    233-234, 239-240, 245-246, 251-252, 257-258
    263-264, 269-270, 275-276, 281-282, 287-288
    293-294, 299-300, 305-306, 311-312, 317-318
    323-324, 329-330, 335-336, 341-342, 347-348
    353-354, 359-360, 365-366, 371-372, 377-378
    383-384, 389-390, 395-396, 401-402, 407-408

Compiler messages(gcc):
regcomp.c: In function ‘S_regclass’:
regcomp.c:10851:415: warning: ignoring return value of ‘get_regex_charset’, declared with attribute warn_unused_result
doio.c: In function ‘Perl_do_msgsnd’:
doio.c:2150:23: warning: defining a type in a cast is invalid in C++
doio.c: In function ‘Perl_do_msgrcv’:
doio.c:2183:22: warning: defining a type in a cast is invalid in C++
perlio.c: In function ‘PerlIOStdio_set_ptrcnt’:
perlio.c:3577:17: warning: pointer targets in assignment differ in signedness
cygwin.c: In function ‘do_spawn’:
cygwin.c:132:14: warning: assignment from incompatible pointer type
cygwin.c: In function ‘XS_Cygwin_posix_to_win_path’:
cygwin.c:346:9: warning: ‘err’ may be used uninitialized in this function
cygwin.c: In function ‘XS_Cygwin_win_to_posix_path’:
cygwin.c:257:9: warning: ‘err’ may be used uninitialized in this function
POSIX.xs:81:7: warning: ‘_tzname’ redeclared without dllimport attribute: previous dllimport ignored
re_comp.c: In function ‘S_regclass’:
re_comp.c:10851:415: warning: ignoring return value of ‘get_regex_charset’, declared with attribute warn_unused_result
regcomp.c:10851:431: warning: ignoring return value of ‘get_regex_charset’, declared with attribute warn_unused_result
cygwin.c:132:23: warning: assignment from incompatible pointer type
re_comp.c:10851:431: warning: ignoring return value of ‘get_regex_charset’, declared with attribute warn_unused_result

-- 
Report by Test::Smoke v1.44 build 1285 running on perl 5.10.1
(Reporter v0.035 / Smoker v0.045)

Logs at http://perl.develop-help.com/reports/
Branch: remotes/origin/smoke-me/module-build
Configuration: default




nntp.perl.org: Perl Programming lists via nntp and http.
Comments to Ask Bjørn Hansen at ask@perl.org | Group listing | About