develooper Front page | perl.daily-build.reports | Postings from February 2012

Smoke [5.15.8] v5.15.8-47-g55d3f3e FAIL(X) linux 2.6.32-5-openvz-686 [slackware] (i686/4 cpu)

From:
Steven Schubiger
Date:
February 28, 2012 01:30
Subject:
Smoke [5.15.8] v5.15.8-47-g55d3f3e FAIL(X) linux 2.6.32-5-openvz-686 [slackware] (i686/4 cpu)
Message ID:
20120228093003.09DB817611B6@schubiger.nine.ch
Automated smoke report for 5.15.8 patch 55d3f3e53492b8cc2dcf2c5ff35f6b379b1685e8 v5.15.8-47-g55d3f3e
p5slackware: Intel(R) Xeon(R) CPU X3320 @ 2.50GHz (GenuineIntel 2500MHz) (i686/4 cpu)
    on        linux - 2.6.32-5-openvz-686 [slackware]
    using     cc version 4.5.2
    smoketime 10 hours 29 minutes (average 39 minutes 20 seconds)

Summary: FAIL(X)

O = OK  F = Failure(s), extended report at the bottom
X = Failure(s) under TEST but not under harness
? = still running or test results not (yet) available
Build failures during:       - = unknown or N/A
c = Configure, m = make, M = make (after miniperl), t = make test-prep

v5.15.8-47-g55d3f3e  Configuration (common) none
----------- ---------------------------------------------------------
X X X X     
X X X X     -Duse64bitint
X X X X     -Duselongdouble
X X X X     -Dusemorebits
X X X X     -Duseithreads
X X X X     -Duseithreads -Duse64bitint
X X X X     -Duseithreads -Duselongdouble
X X X X     -Duseithreads -Dusemorebits
| | | +----- PERLIO = perlio -DDEBUGGING
| | +------- PERLIO = stdio  -DDEBUGGING
| +--------- PERLIO = perlio
+----------- PERLIO = stdio


Locally applied patches:
    uncommitted-changes
    SMOKE55d3f3e53492b8cc2dcf2c5ff35f6b379b1685e8

Failures: (common-args) none
[stdio/perlio] 
[stdio/perlio] -DDEBUGGING
[stdio/perlio] -Duse64bitint
[stdio/perlio] -DDEBUGGING -Duse64bitint
[stdio/perlio] -Duselongdouble
[stdio/perlio] -DDEBUGGING -Duselongdouble
[stdio/perlio] -Dusemorebits
[stdio/perlio] -DDEBUGGING -Dusemorebits
Inconsistent test results (between TEST and harness):
    ../ext/POSIX/t/sysconf.t................ ........................................... FAILED at test 50

[stdio/perlio] -Duseithreads
[stdio/perlio] -DDEBUGGING -Duseithreads
[stdio/perlio] -Duseithreads -Duse64bitint
[stdio/perlio] -DDEBUGGING -Duseithreads -Duse64bitint
[stdio/perlio] -Duseithreads -Duselongdouble
[stdio/perlio] -DDEBUGGING -Duseithreads -Duselongdouble
[stdio/perlio] -Duseithreads -Dusemorebits
Inconsistent test results (between TEST and harness):
    ../t/dist/threads/t/stress_re.t......... ...................................... FAILED at test 30
    ../t/dist/threads/t/stress_cv.t......... ...................................... FAILED at test 30
    ../ext/POSIX/t/sysconf.t................ ........................................... FAILED at test 50
    ../t/dist/threads/t/stress_string.t..... .................................. FAILED at test 30

[stdio] -DDEBUGGING -Duseithreads -Dusemorebits
Inconsistent test results (between TEST and harness):
    ../t/dist/threads/t/stress_re.t......... ...................................... FAILED at test 29
    ../t/dist/threads/t/stress_cv.t......... ...................................... FAILED at test 29
    ../ext/POSIX/t/sysconf.t................ ........................................... FAILED at test 50
    ../t/op/coreamp.t....................... .................................................. FAILED at test 287
    ../t/dist/threads/t/stress_string.t..... .................................. FAILED at test 29

[perlio] -DDEBUGGING -Duseithreads -Dusemorebits
Inconsistent test results (between TEST and harness):
    ../t/dist/threads/t/stress_re.t......... ...................................... FAILED at test 29
    ../t/dist/threads/t/stress_cv.t......... ...................................... FAILED at test 30
    ../ext/POSIX/t/sysconf.t................ ........................................... FAILED at test 50
    ../t/dist/threads/t/stress_string.t..... .................................. FAILED at test 30

Compiler messages(gcc):
try.c: In function 'main':
try.c:22:14: error: 'KERN_PROC' undeclared (first use in this function)
try.c:23:14: error: 'KERN_PROC_PATHNAME' undeclared (first use in this function)
try.c:5689:17: warning: extra tokens at end of #ifdef directive
try.c:5692:18: warning: extra tokens at end of #ifdef directive
try.c:5695:19: warning: extra tokens at end of #ifdef directive
try.c:5698:19: warning: extra tokens at end of #ifdef directive
try.c:5725:17: warning: extra tokens at end of #ifdef directive
try.c:5728:18: warning: extra tokens at end of #ifdef directive
try.c:5731:19: warning: extra tokens at end of #ifdef directive
try.c:5734:19: warning: extra tokens at end of #ifdef directive
try.c:5761:17: warning: extra tokens at end of #ifdef directive
try.c:5764:18: warning: extra tokens at end of #ifdef directive
try.c:5767:19: warning: extra tokens at end of #ifdef directive
try.c:5770:19: warning: extra tokens at end of #ifdef directive
try.c:5797:16: warning: extra tokens at end of #ifdef directive
try.c:5800:17: warning: extra tokens at end of #ifdef directive
try.c:5803:18: warning: extra tokens at end of #ifdef directive
try.c:5806:18: warning: extra tokens at end of #ifdef directive
try.c:5833:18: warning: extra tokens at end of #ifdef directive
try.c:5836:19: warning: extra tokens at end of #ifdef directive
try.c:5839:20: warning: extra tokens at end of #ifdef directive
try.c:5842:20: warning: extra tokens at end of #ifdef directive
try.c:6589:18: warning: extra tokens at end of #ifdef directive
try.c:6592:19: warning: extra tokens at end of #ifdef directive
try.c:6595:20: warning: extra tokens at end of #ifdef directive
try.c:6598:20: warning: extra tokens at end of #ifdef directive
try.c:6625:18: warning: extra tokens at end of #ifdef directive
try.c:6628:19: warning: extra tokens at end of #ifdef directive
try.c:6631:20: warning: extra tokens at end of #ifdef directive
try.c:6634:20: warning: extra tokens at end of #ifdef directive
try.c:6661:18: warning: extra tokens at end of #ifdef directive
try.c:6664:19: warning: extra tokens at end of #ifdef directive
try.c:6667:20: warning: extra tokens at end of #ifdef directive
try.c:6670:20: warning: extra tokens at end of #ifdef directive
try.c:6697:17: warning: extra tokens at end of #ifdef directive
try.c:6700:18: warning: extra tokens at end of #ifdef directive
try.c:6703:19: warning: extra tokens at end of #ifdef directive
try.c:6706:19: warning: extra tokens at end of #ifdef directive
try.c:6733:19: warning: extra tokens at end of #ifdef directive
try.c:6736:20: warning: extra tokens at end of #ifdef directive
try.c:6739:21: warning: extra tokens at end of #ifdef directive
try.c:6742:21: warning: extra tokens at end of #ifdef directive
regcomp.c: In function 'S_regclass':
regcomp.c:10851:7: warning: ignoring return value of 'get_regex_charset', declared with attribute warn_unused_result
re_comp.c: In function 'S_regclass':
re_comp.c:10851:7: warning: ignoring return value of 'get_regex_charset', declared with attribute warn_unused_result

-- 
Report by Test::Smoke v1.44 build 1285 running on perl 5.12.3
(Reporter v0.035 / Smoker v0.045)



nntp.perl.org: Perl Programming lists via nntp and http.
Comments to Ask Bjørn Hansen at ask@perl.org | Group listing | About