develooper Front page | perl.daily-build.reports | Postings from February 2012

Smoke [5.15.7] v5.15.7-226-gb9a766d PASS darwin 11.3.0 (Intel Core i7/1 cpu)

From:
tony
Date:
February 28, 2012 01:24
Subject:
Smoke [5.15.7] v5.15.7-226-gb9a766d PASS darwin 11.3.0 (Intel Core i7/1 cpu)
Message ID:
201202280923.q1S9NrhU005800@mars.tony.develop-help.com
Automated smoke report for 5.15.7 patch b9a766d380b8497cd99934b1093a4c2bdeaf740b v5.15.7-226-gb9a766d
pallas.tony.develop-help.com: Mac mini (2 GHz) (Intel Core i7/1 cpu)
    on        darwin - 11.3.0 (Mac OS X)
    using     cc version 4.2.1 (Based on Apple Inc. build 5658) (LLVM build 2335.15.00)
    smoketime 3 hours 41 minutes (average 18 minutes 28 seconds)

Summary: PASS

O = OK  F = Failure(s), extended report at the bottom
X = Failure(s) under TEST but not under harness
? = still running or test results not (yet) available
Build failures during:       - = unknown or N/A
c = Configure, m = make, M = make (after miniperl), t = make test-prep

v5.15.7-226-gb9a766d  Configuration (common) none
----------- ---------------------------------------------------------
O O O O     -Dusemymalloc
O O O O     -DNO_MATHOMS
O O O O     -Dusesitecustomize
O O O O     -Duseithreads -Dusemymalloc
O O O O     -Duseithreads -DNO_MATHOMS
O O O O     -Duseithreads -Dusesitecustomize
| | | +----- PERLIO = perlio -DDEBUGGING
| | +------- PERLIO = stdio  -DDEBUGGING
| +--------- PERLIO = perlio
+----------- PERLIO = stdio


Locally applied patches:
    uncommitted-changes
    SMOKEb9a766d380b8497cd99934b1093a4c2bdeaf740b

Testsuite was run only with 'harness' and HARNESS_OPTIONS=j3

Passed Todo tests: (common-args) none
[stdio/perlio] -Dusemymalloc
[stdio/perlio] -DDEBUGGING -Dusemymalloc
[stdio/perlio] -DNO_MATHOMS
[stdio/perlio] -DDEBUGGING -DNO_MATHOMS
[stdio/perlio] -Dusesitecustomize
[stdio/perlio] -DDEBUGGING -Dusesitecustomize
[stdio/perlio] -Duseithreads -Dusemymalloc
[stdio/perlio] -DDEBUGGING -Duseithreads -Dusemymalloc
[stdio/perlio] -Duseithreads -DNO_MATHOMS
[stdio/perlio] -DDEBUGGING -Duseithreads -DNO_MATHOMS
[stdio/perlio] -Duseithreads -Dusesitecustomize
[stdio/perlio] -DDEBUGGING -Duseithreads -Dusesitecustomize
../cpan/CGI/t/tmpdir.t......................................PASSED
    3-9

Compiler messages(gcc):
try.c: In function 'main':
try.c:23: error: 'KERN_PROC_PATHNAME' undeclared (first use in this function)
try.c:23: error: (Each undeclared identifier is reported only once
try.c:23: error: for each function it appears in.)
malloc.c:708: warning: cast from pointer to integer of different size
malloc.c: In function 'getpages':
malloc.c:1509: warning: comparison between signed and unsigned
perlio.c: In function 'PerlIOStdio_set_ptrcnt':
perlio.c:3575: warning: pointer targets in assignment differ in signedness
Call.xs: In function 'filter_call':
Call.xs:63: warning: format '%d' expects type 'int', but argument 3 has type 'STRLEN'
Call.xs:63: warning: format '%d' expects type 'int', but argument 5 has type 'STRLEN'
Call.xs:100: warning: format '%d' expects type 'int', but argument 4 has type 'STRLEN'
Call.xs:156: warning: format '%d' expects type 'int', but argument 3 has type 'STRLEN'
Call.xs:175: warning: format '%d' expects type 'int', but argument 4 has type 'STRLEN'
malloc.c: In function 'Perl_sbrk':
malloc.c:2395: warning: format '%ld' expects type 'long int', but argument 3 has type 'int'
malloc.c:2395: warning: format '%ld' expects type 'long int', but argument 4 has type 'int'

-- 
Report by Test::Smoke v1.44 build 1285 running on perl 5.12.3
(Reporter v0.035 / Smoker v0.045)

Logs at http://perl.develop-help.com/reports/
Branch: remotes/origin/smoke-me/io-socket-ip
Configuration: extras




nntp.perl.org: Perl Programming lists via nntp and http.
Comments to Ask Bjørn Hansen at ask@perl.org | Group listing | About