develooper Front page | perl.daily-build.reports | Postings from February 2012

Smoke [5.15.8] v5.15.8-49-g60bebca PASS linux 2.6.32-5-kirkwood [debian] (armv5tel/)

From:
tony
Date:
February 27, 2012 22:42
Subject:
Smoke [5.15.8] v5.15.8-49-g60bebca PASS linux 2.6.32-5-kirkwood [debian] (armv5tel/)
Message ID:
201202280642.q1S6gcQJ013060@mars.tony.develop-help.com
Automated smoke report for 5.15.8 patch 60bebca7a47c28bb4220b1e9671d4e06d3c3d74c v5.15.8-49-g60bebca
iapetus:  ( 0MHz) (armv5tel/)
    on        linux - 2.6.32-5-kirkwood [debian]
    using     cc version 4.4.5
    smoketime 18 hours 13 minutes (average 4 hours 33 minutes)

Summary: PASS

O = OK  F = Failure(s), extended report at the bottom
X = Failure(s) under TEST but not under harness
? = still running or test results not (yet) available
Build failures during:       - = unknown or N/A
c = Configure, m = make, M = make (after miniperl), t = make test-prep

v5.15.8-49-g60bebca  Configuration (common) none
----------- ---------------------------------------------------------
O O O O     
O O O O     -Duseithreads
| | | +----- PERLIO = perlio -DDEBUGGING
| | +------- PERLIO = stdio  -DDEBUGGING
| +--------- PERLIO = perlio
+----------- PERLIO = stdio


Locally applied patches:
    uncommitted-changes
    SMOKE60bebca7a47c28bb4220b1e9671d4e06d3c3d74c

Compiler messages(gcc):
try.c: In function 'main':
try.c:22: error: 'KERN_PROC' undeclared (first use in this function)
try.c:22: error: (Each undeclared identifier is reported only once
try.c:22: error: for each function it appears in.)
try.c:23: error: 'KERN_PROC_PATHNAME' undeclared (first use in this function)
try.c:4:25: error: mach-o/dyld.h: No such file or directory
try.c:13: error: 'uint32_t' undeclared (first use in this function)
try.c:13: error: (Each undeclared identifier is reported only once
try.c:13: error: for each function it appears in.)
try.c:13: error: expected ';' before 'size'
try.c:25: error: 'size' undeclared (first use in this function)
regcomp.c: In function 'S_regclass':
regcomp.c:10851: warning: ignoring return value of 'get_regex_charset', declared with attribute warn_unused_result
re_comp.c: In function 'S_regclass':
re_comp.c:10851: warning: ignoring return value of 'get_regex_charset', declared with attribute warn_unused_result

-- 
Report by Test::Smoke v1.44 build 1285 running on perl 5.10.1
(Reporter v0.035 / Smoker v0.045)

Logs at http://perl.develop-help.com/reports/
Branch: remotes/origin/smoke-me/kick-FAKE_BIT_BUCKET
Configuration: default




nntp.perl.org: Perl Programming lists via nntp and http.
Comments to Ask Bjørn Hansen at ask@perl.org | Group listing | About