develooper Front page | perl.daily-build.reports | Postings from February 2012

Smoke [blead] v5.15.8-37-ga892b81 FAIL(X) linux 3.0.0-15-generic [debian] (x86_64/8 cpu)

From:
George Greer
Date:
February 27, 2012 21:40
Subject:
Smoke [blead] v5.15.8-37-ga892b81 FAIL(X) linux 3.0.0-15-generic [debian] (x86_64/8 cpu)
Message ID:
201202280540.q1S5eaiA017263@m-l.org
Smoke logs available at http://m-l.org/~perl/smoke/perl/

Automated smoke report for 5.15.8 patch a892b81a8ad64d2a842be6138a2983f4b7c315df v5.15.8-37-ga892b81
zwei: Intel(R) Core(TM) i7 CPU 920 @ 2.67GHz (GenuineIntel 2668MHz) (x86_64/8 cpu)
    on        linux - 3.0.0-15-generic [debian]
    using     clang version 4.2.1 Compatible Clang Compiler
    smoketime 21 hours 13 minutes (average 1 hour 3 minutes)

Summary: FAIL(X)

O = OK  F = Failure(s), extended report at the bottom
X = Failure(s) under TEST but not under harness
? = still running or test results not (yet) available
Build failures during:       - = unknown or N/A
c = Configure, m = make, M = make (after miniperl), t = make test-prep

v5.15.8-37-ga892b81  Configuration (common) -A -Dcc=clang append:ccflags=" -fcatch-undefined-behavior "
----------- ---------------------------------------------------------
O O O O O O O O 
O X O X O O O O -Accflags=-DPERL_POISON
O O O O O O O O -Duse64bitall
O O O O O O O X -Dusemorebits
O O O O O O O O -Dmad
O O O O O O O X -Duseithreads
O O O O O O O O -Duseithreads -Accflags=-DPERL_POISON
O O O O O O O O -Duseithreads -Duse64bitall
O O O O O O O O -Duseithreads -Dusemorebits
O O O O O O O O -Duseithreads -Dmad
| | | | | +- LC_ALL = en_US.utf8 -DDEBUGGING
| | | | +--- PERLIO = perlio -DDEBUGGING
| | | +----- PERLIO = stdio  -DDEBUGGING
| | +------- LC_ALL = en_US.utf8
| +--------- PERLIO = perlio
+----------- PERLIO = stdio 

Locally applied patches:
    uncommitted-changes
    SMOKEa892b81a8ad64d2a842be6138a2983f4b7c315df

Failures: (common-args) -A -Dcc=clang append:ccflags=" -fcatch-undefined-behavior "
[perlio] -Accflags=-DPERL_POISON
[en_US.utf8] -DDEBUGGING -Dusemorebits
[en_US.utf8] -DDEBUGGING -Duseithreads
Inconsistent test results (between TEST and harness):
    ../lib/Benchmark.t...................... ................................................ FAILED at test 15

[en_US.utf8] -Accflags=-DPERL_POISON
Inconsistent test results (between TEST and harness):
    ../t/comp/require.t..................... ............................................... FAILED at test 46

Compiler messages(gcc):
try.c:22:14: error: use of undeclared identifier 'KERN_PROC'; did you mean 'KERN_PROF'?
try.c:23:14: error: use of undeclared identifier 'KERN_PROC_PATHNAME'
try.c:5785:17: warning: extra tokens at end of #ifdef directive [-Wextra-tokens]
try.c:5788:18: warning: extra tokens at end of #ifdef directive [-Wextra-tokens]
try.c:5791:19: warning: extra tokens at end of #ifdef directive [-Wextra-tokens]
try.c:5794:19: warning: extra tokens at end of #ifdef directive [-Wextra-tokens]
try.c:5821:17: warning: extra tokens at end of #ifdef directive [-Wextra-tokens]
try.c:5824:18: warning: extra tokens at end of #ifdef directive [-Wextra-tokens]
try.c:5827:19: warning: extra tokens at end of #ifdef directive [-Wextra-tokens]
try.c:5830:19: warning: extra tokens at end of #ifdef directive [-Wextra-tokens]
try.c:5857:17: warning: extra tokens at end of #ifdef directive [-Wextra-tokens]
try.c:5860:18: warning: extra tokens at end of #ifdef directive [-Wextra-tokens]
try.c:5863:19: warning: extra tokens at end of #ifdef directive [-Wextra-tokens]
try.c:5866:19: warning: extra tokens at end of #ifdef directive [-Wextra-tokens]
try.c:5893:16: warning: extra tokens at end of #ifdef directive [-Wextra-tokens]
try.c:5896:17: warning: extra tokens at end of #ifdef directive [-Wextra-tokens]
try.c:5899:18: warning: extra tokens at end of #ifdef directive [-Wextra-tokens]
try.c:5902:18: warning: extra tokens at end of #ifdef directive [-Wextra-tokens]
try.c:5929:18: warning: extra tokens at end of #ifdef directive [-Wextra-tokens]
try.c:5932:19: warning: extra tokens at end of #ifdef directive [-Wextra-tokens]
try.c:5935:20: warning: extra tokens at end of #ifdef directive [-Wextra-tokens]
try.c:5938:20: warning: extra tokens at end of #ifdef directive [-Wextra-tokens]
try.c:6817:18: warning: extra tokens at end of #ifdef directive [-Wextra-tokens]
try.c:6820:19: warning: extra tokens at end of #ifdef directive [-Wextra-tokens]
try.c:6823:20: warning: extra tokens at end of #ifdef directive [-Wextra-tokens]
try.c:6826:20: warning: extra tokens at end of #ifdef directive [-Wextra-tokens]
try.c:6853:18: warning: extra tokens at end of #ifdef directive [-Wextra-tokens]
try.c:6856:19: warning: extra tokens at end of #ifdef directive [-Wextra-tokens]
try.c:6859:20: warning: extra tokens at end of #ifdef directive [-Wextra-tokens]
try.c:6862:20: warning: extra tokens at end of #ifdef directive [-Wextra-tokens]
try.c:6889:18: warning: extra tokens at end of #ifdef directive [-Wextra-tokens]
try.c:6892:19: warning: extra tokens at end of #ifdef directive [-Wextra-tokens]
try.c:6895:20: warning: extra tokens at end of #ifdef directive [-Wextra-tokens]
try.c:6898:20: warning: extra tokens at end of #ifdef directive [-Wextra-tokens]
try.c:6925:17: warning: extra tokens at end of #ifdef directive [-Wextra-tokens]
try.c:6928:18: warning: extra tokens at end of #ifdef directive [-Wextra-tokens]
try.c:6931:19: warning: extra tokens at end of #ifdef directive [-Wextra-tokens]
try.c:6934:19: warning: extra tokens at end of #ifdef directive [-Wextra-tokens]
try.c:6961:19: warning: extra tokens at end of #ifdef directive [-Wextra-tokens]
try.c:6964:20: warning: extra tokens at end of #ifdef directive [-Wextra-tokens]
try.c:6967:21: warning: extra tokens at end of #ifdef directive [-Wextra-tokens]
try.c:6970:21: warning: extra tokens at end of #ifdef directive [-Wextra-tokens]
mro.c:619:21: warning: expression result unused [-Wunused-value]
mro.c:665:2: warning: expression result unused [-Wunused-value]
util.c:579:5: warning: expression result unused [-Wunused-value]
util.c:2723:5: warning: expression result unused [-Wunused-value]
util.c:2880:5: warning: expression result unused [-Wunused-value]
pp_hot.c:144:3: warning: expression result unused [-Wunused-value]
pp_sys.c:443:25: warning: expression result unused [-Wunused-value]
pp_sys.c:480:25: warning: expression result unused [-Wunused-value]
regexec.c:4227:19: warning: expression result unused [-Wunused-value]
regexec.c:5496:9: warning: expression result unused [-Wunused-value]
pp_ctl.c:284:2: warning: expression result unused [-Wunused-value]
doop.c:696:3: warning: expression result unused [-Wunused-value]
doop.c:691:5: warning: expression result unused [-Wunused-value]
pp_ctl.c:404:2: warning: expression result unused [-Wunused-value]
pp_ctl.c:416:8: warning: expression result unused [-Wunused-value]
doio.c:638:17: warning: expression result unused [-Wunused-value]
doio.c:642:17: warning: expression result unused [-Wunused-value]
sv.c:502:5: warning: expression result unused [-Wunused-value]
sv.c:544:5: warning: expression result unused [-Wunused-value]
utf8.c:1469:20: warning: implicit conversion from 'int' to 'U8' (aka 'unsigned char') changes value from 65533 to 253 [-Wconstant-conversion]
pp_ctl.c:975:3: warning: expression result unused [-Wunused-value]
pp_hot.c:1215:5: warning: expression result unused [-Wunused-value]
scope.c:691:68: warning: conversion specifies type 'long' but the argument has type 'I32' (aka 'int') [-Wformat]
scope.c:691:72: warning: conversion specifies type 'long' but the argument has type 'I32' (aka 'int') [-Wformat]
pp.c:3362:5: warning: expression result unused [-Wunused-value]
pp.c:3539:22: warning: implicit conversion from 'int' to 'U8' (aka 'unsigned char') changes value from 65533 to 253 [-Wconstant-conversion]
pp.c:3607:2: warning: expression result unused [-Wunused-value]
utf8.c:2629:6: warning: expression result unused [-Wunused-value]
pp.c:3750:2: warning: expression result unused [-Wunused-value]
pp.c:3853:12: warning: implicit conversion from 'int' to 'U8' (aka 'unsigned char') changes value from 65533 to 253 [-Wconstant-conversion]
pp.c:3987:2: warning: expression result unused [-Wunused-value]
pp.c:4061:12: warning: implicit conversion from 'int' to 'U8' (aka 'unsigned char') changes value from 65533 to 253 [-Wconstant-conversion]
pp.c:4086:2: warning: expression result unused [-Wunused-value]
pp.c:4289:26: warning: implicit conversion from 'int' to 'U8' (aka 'unsigned char') changes value from 65533 to 253 [-Wconstant-conversion]
pp.c:4186:5: warning: expression result unused [-Wunused-value]
pp_hot.c:1640:2: warning: expression result unused [-Wunused-value]
pp_sys.c:1735:2: warning: expression result unused [-Wunused-value]
sv.c:2757:3: warning: expression result unused [-Wunused-value]
doio.c:2287:2: warning: expression result unused [-Wunused-value]
pp_hot.c:2341:6: warning: expression result unused [-Wunused-value]
sv.c:3661:6: warning: expression result unused [-Wunused-value]
perl.c:365:6: warning: expression result unused [-Wunused-value]
sv.c:4088:6: warning: expression result unused [-Wunused-value]
sv.c:4090:6: warning: expression result unused [-Wunused-value]
pp_ctl.c:2245:3: warning: expression result unused [-Wunused-value]
pp_ctl.c:2260:6: warning: expression result unused [-Wunused-value]
sv.c:4496:5: warning: expression result unused [-Wunused-value]
sv.c:4547:5: warning: expression result unused [-Wunused-value]
sv.c:4605:6: warning: expression result unused [-Wunused-value]
sv.c:4652:5: warning: expression result unused [-Wunused-value]
perlio.c:5191:21: warning: comparison of integers of different signs: 'size_t' (aka 'unsigned long') and 'int' [-Wsign-compare]
sv.c:5211:5: warning: expression result unused [-Wunused-value]
sv.c:7625:5: warning: expression result unused [-Wunused-value]
toke.c:2203:3: warning: expression result unused [-Wunused-value]
toke.c:3860:5: warning: expression result unused [-Wunused-value]
sv.c:9124:6: warning: expression result unused [-Wunused-value]
pp_ctl.c:4490:5: warning: expression result unused [-Wunused-value]
op.c:8021:5: warning: expression result unused [-Wunused-value]
sv.c:9520:5: warning: expression result unused [-Wunused-value]
pp_ctl.c:5478:5: warning: expression result unused [-Wunused-value]
toke.c:7652:7: warning: expression result unused [-Wunused-value]
op.c:9405:9: warning: array index of '2' indexes past the end of an array (that contains 1 elements) [-Warray-bounds]
op.c:10066:4: warning: expression result unused [-Wunused-value]
Opcode.xs:268:9: warning: expression result unused [-Wunused-value]
Bzip2.xs:326:5: warning: expression result unused [-Wunused-value]
./const-c.inc:47:2: warning: expression result unused [-Wunused-value]
./const-c.inc:81:5: warning: expression result unused [-Wunused-value]
Call.xs:62:58: warning: conversion specifies type 'int' but the argument has type 'STRLEN' (aka 'unsigned long') [-Wformat]
Call.xs:62:78: warning: conversion specifies type 'int' but the argument has type 'STRLEN' (aka 'unsigned long') [-Wformat]
Call.xs:99:53: warning: conversion specifies type 'int' but the argument has type 'STRLEN' (aka 'unsigned long') [-Wformat]
Call.xs:155:46: warning: conversion specifies type 'int' but the argument has type 'STRLEN' (aka 'unsigned long') [-Wformat]
Call.xs:174:57: warning: conversion specifies type 'int' but the argument has type 'STRLEN' (aka 'unsigned long') [-Wformat]
Util.xs:55:9: warning: expression result unused [-Wunused-value]
scalar.xs:48:5: warning: expression result unused [-Wunused-value]
Typemap.xs:179:46: warning: conversion specifies type 'unsigned int' but the argument has type 'UV' (aka 'unsigned long') [-Wformat]
Typemap.xs:265:3: warning: expression result unused [-Wunused-value]
./const-c.inc:38:2: warning: expression result unused [-Wunused-value]
Typemap.xs:287:3: warning: expression result unused [-Wunused-value]
./const-c.inc:72:5: warning: expression result unused [-Wunused-value]
Typemap.xs:310:3: warning: expression result unused [-Wunused-value]
Typemap.xs:333:3: warning: expression result unused [-Wunused-value]
Typemap.xs:356:3: warning: expression result unused [-Wunused-value]
Glob.xs:100:2: warning: expression result unused [-Wunused-value]
Glob.xs:108:6: warning: expression result unused [-Wunused-value]
mro.xs:120:7: warning: expression result unused [-Wunused-value]
Storable.xs:1793:3: warning: expression result unused [-Wunused-value]
./const-c.inc:73:5: warning: expression result unused [-Wunused-value]
Zlib.xs:619:5: warning: expression result unused [-Wunused-value]
re_exec.c:4227:19: warning: expression result unused [-Wunused-value]
Storable.xs:4035:2: warning: null passed to a callee which requires a non-null argument [-Wnonnull]
re_exec.c:5496:9: warning: expression result unused [-Wunused-value]
Storable.xs:4468:2: warning: expression result unused [-Wunused-value]
Storable.xs:5353:3: warning: expression result unused [-Wunused-value]
Storable.xs:5400:2: warning: expression result unused [-Wunused-value]
Storable.xs:5440:2: warning: null passed to a callee which requires a non-null argument [-Wnonnull]
Storable.xs:5503:2: warning: null passed to a callee which requires a non-null argument [-Wnonnull]
Storable.xs:5814:4: warning: expression result unused [-Wunused-value]
Storable.xs:5855:3: warning: expression result unused [-Wunused-value]
Storable.xs:6014:5: warning: expression result unused [-Wunused-value]
APItest.xs:112:5: warning: expression result unused [-Wunused-value]
APItest.xs:1471:2: warning: expression result unused [-Wunused-value]
APItest.xs:2175:2: warning: expression result unused [-Wunused-value]
Collate.xs:607:2: warning: expression result unused [-Wunused-value]
Collate.xs:597:2: warning: expression result unused [-Wunused-value]
Unicode.xs:176:6: warning: expression result unused [-Wunused-value]
Unicode.xs:334:6: warning: expression result unused [-Wunused-value]
ExtTest.xs:44:2: warning: expression result unused [-Wunused-value]
ExtTest.xs:78:5: warning: expression result unused [-Wunused-value]
regcomp.c:12647:11: warning: expression result unused [-Wunused-value]
pp_ctl.c:utf8.c:1469:20: warning: implicit conversion from 'int' to 'U8' (aka 'unsigned char') changes value from 65533 to 253 [-Wconstant-conversion]
975:3: warning: expression result unused [-Wunused-value]
regexec.c:4227:19: warning: expr:4605:6: warning: expression result unused [-Wunused-value]
../../sv.h:233:2: mro.xs:120:7: warning: expression result unused [-Wunused-value]
144:3: warning: expression result unused 
./sv.h:1560toke.c:2203:3: warning: expression result unused [-Wunused-value]
In file included from ./perl.h:3436sv.c:3661:6: warning: expression result unused [-Wunused-value]
./sv.h:295:47toke.c:7652:7: warning: expression result unused [-Wunused-value]
utf8.c:1469:20: warning: pp_sys.c:480:25: warning: expression result unused [-Wunused-value]
pp_ctl.c 284:2: warning: In file included from utf8.c:33:
regexec.c:2630:8: warning: expression result unused [-Wunused-value]
re_exec.c:2630:8: warning: expression result unused [-Wunused-value]
In file included from ./perl.h:3437sv.c:4496:5: warning: expression result unused [-Wunused-value]
In file :4490:5: warning: :28:
#  define SvPVX_const(sv)       ((const char*)(0 + (sv)->sv_u.svu_pv))util.c:2723:5: warning: expression result unused [-Wunused-value]
pp_hot.c:2341:6:pp.c:3539:22: warning: implicit conversion from 'int' to 'U8' (aka 'unsigned char') changes value from 65533 to 253 [-Wconstant-conversion]
pp.cpp_sys.c:1735:2: warning: expression result unused [-Wunused-value]
-- 
Report by Test::Smoke v1.44 build 1285 running on perl 5.12.4
(Reporter v0.035 / Smoker v0.045)




nntp.perl.org: Perl Programming lists via nntp and http.
Comments to Ask Bjørn Hansen at ask@perl.org | Group listing | About