develooper Front page | perl.daily-build.reports | Postings from February 2012

Smoke [5.15.8] v5.15.8-47-g55d3f3e FAIL(X) linux 3.2.0-1-amd64 [debian] (x86_64/2 cpu)

From:
njh
Date:
February 27, 2012 16:50
Subject:
Smoke [5.15.8] v5.15.8-47-g55d3f3e FAIL(X) linux 3.2.0-1-amd64 [debian] (x86_64/2 cpu)
Message ID:
201202280050.q1S0oG32014101@gateway.bandsman.co.uk
Automated smoke report for 5.15.8 patch 55d3f3e53492b8cc2dcf2c5ff35f6b379b1685e8 v5.15.8-47-g55d3f3e
gateway: AMD Athlon(tm) Dual Core Processor 4850e (AuthenticAMD 2500MHz) (x86_64/2 cpu)
    on        linux - 3.2.0-1-amd64 [debian]
    using     cc version 4.6.2
    smoketime 36 minutes 7 seconds (average 36 minutes 7 seconds)

Summary: FAIL(X)

O = OK  F = Failure(s), extended report at the bottom
X = Failure(s) under TEST but not under harness
? = still running or test results not (yet) available
Build failures during:       - = unknown or N/A
c = Configure, m = make, M = make (after miniperl), t = make test-prep

v5.15.8-47-g55d3f3e  Configuration (common) -Accflags="-O2 -W -Wformat=2 -Wall -Wextra -pipe -mtune=native -march=native -fomit-frame-pointer -mfpmath=sse -D_FORTIFY_SOURCE=2 -fstack-protector -Wstack-protector -Wfloat-equal"
----------- ---------------------------------------------------------
X -         -Duseithreads
| +--------- -DDEBUGGING
+----------- no debugging


Locally applied patches:
    uncommitted-changes
    SMOKE55d3f3e53492b8cc2dcf2c5ff35f6b379b1685e8

Failures: (common-args) -Accflags="-O2 -W -Wformat=2 -Wall -Wextra -pipe -mtune=native -march=native -fomit-frame-pointer -mfpmath=sse -D_FORTIFY_SOURCE=2 -fstack-protector -Wstack-protector -Wfloat-equal"
[default] -Duseithreads
Inconsistent test results (between TEST and harness):
    ../t/dist/Net-Ping/t/510_ping_udp.t..... .................................. FAILED at test 2

Compiler messages(gcc):
Configure ...try.c: In function ‘main’:
try.c:1:14: warning: unused parameter ‘argc’ [-Wunused-parameter]
try.c:1:26: warning: unused parameter ‘argv’ [-Wunused-parameter]
try.c: In function ‘main’:
try.c: In function ‘blech’:
try.c:8:16: warning: unused parameter ‘s’ [-Wunused-parameter]
try.c: In function ‘blech_in_list’:
try.c:9:24: warning: unused parameter ‘s’ [-Wunused-parameter]
try.c:31:1: warning: control reaches end of non-void function [-Wreturn-type]
try.c:28:16: warning: unused parameter ‘x’ [-Wunused-parameter]
try.c:36:6: warning: ignoring return value of ‘pipe’, declared with attribute warn_unused_result [-Wunused-result]
try.c:37:6: warning: ignoring return value of ‘pipe’, declared with attribute warn_unused_result [-Wunused-result]
try.c:53:8: warning: ignoring return value of ‘write’, declared with attribute warn_unused_result [-Wunused-result]
try.c:66:8: warning: ignoring return value of ‘write’, declared with attribute warn_unused_result [-Wunused-result]
try.c:72:8: warning: ignoring return value of ‘write’, declared with attribute warn_unused_result [-Wunused-result]
try.c:78:6: warning: ignoring return value of ‘read’, declared with attribute warn_unused_result [-Wunused-result]
try.c:8:16: warning: unused parameter ‘x’ [-Wunused-parameter]
try.c:3:15: warning: unused parameter ‘argc’ [-Wunused-parameter]
try.c:3:27: warning: unused parameter ‘argv’ [-Wunused-parameter]
try.c: In function ‘bletch’:
try.c:11:17: warning: unused parameter ‘s’ [-Wunused-parameter]
try.c:12:26: warning: unused parameter ‘argv’ [-Wunused-parameter]
try.c:52:19: warning: comparison between signed and unsigned integer expressions [-Wsign-compare]
try.c:22:14: error: ‘KERN_PROC’ undeclared (first use in this function)
try.c:23:14: error: ‘KERN_PROC_PATHNAME’ undeclared (first use in this function)
try.c:14:10: warning: unused parameter ‘argc’ [-Wunused-parameter]
try.c:4069:17: warning: extra tokens at end of #ifdef directive [enabled by default]
try.c:4072:18: warning: extra tokens at end of #ifdef directive [enabled by default]
try.c:4075:19: warning: extra tokens at end of #ifdef directive [enabled by default]
try.c:4078:19: warning: extra tokens at end of #ifdef directive [enabled by default]
try.c:4105:17: warning: extra tokens at end of #ifdef directive [enabled by default]
try.c:4108:18: warning: extra tokens at end of #ifdef directive [enabled by default]
try.c:4111:19: warning: extra tokens at end of #ifdef directive [enabled by default]
try.c:4114:19: warning: extra tokens at end of #ifdef directive [enabled by default]
try.c:4165:17: warning: extra tokens at end of #ifdef directive [enabled by default]
try.c:4168:18: warning: extra tokens at end of #ifdef directive [enabled by default]
try.c:4171:19: warning: extra tokens at end of #ifdef directive [enabled by default]
try.c:4174:19: warning: extra tokens at end of #ifdef directive [enabled by default]
try.c:4201:16: warning: extra tokens at end of #ifdef directive [enabled by default]
try.c:4204:17: warning: extra tokens at end of #ifdef directive [enabled by default]
try.c:4207:18: warning: extra tokens at end of #ifdef directive [enabled by default]
try.c:4210:18: warning: extra tokens at end of #ifdef directive [enabled by default]
try.c:4465:18: warning: extra tokens at end of #ifdef directive [enabled by default]
try.c:4468:19: warning: extra tokens at end of #ifdef directive [enabled by default]
try.c:4471:20: warning: extra tokens at end of #ifdef directive [enabled by default]
try.c:4474:20: warning: extra tokens at end of #ifdef directive [enabled by default]
try.c:10249:18: warning: extra tokens at end of #ifdef directive [enabled by default]
try.c:10252:19: warning: extra tokens at end of #ifdef directive [enabled by default]
try.c:10255:20: warning: extra tokens at end of #ifdef directive [enabled by default]
try.c:10258:20: warning: extra tokens at end of #ifdef directive [enabled by default]
try.c:10285:18: warning: extra tokens at end of #ifdef directive [enabled by default]
try.c:10288:19: warning: extra tokens at end of #ifdef directive [enabled by default]
try.c:10291:20: warning: extra tokens at end of #ifdef directive [enabled by default]
try.c:10294:20: warning: extra tokens at end of #ifdef directive [enabled by default]
try.c:10321:18: warning: extra tokens at end of #ifdef directive [enabled by default]
try.c:10324:19: warning: extra tokens at end of #ifdef directive [enabled by default]
try.c:10327:20: warning: extra tokens at end of #ifdef directive [enabled by default]
try.c:10330:20: warning: extra tokens at end of #ifdef directive [enabled by default]
try.c:10357:17: warning: extra tokens at end of #ifdef directive [enabled by default]
try.c:10360:18: warning: extra tokens at end of #ifdef directive [enabled by default]
try.c:10363:19: warning: extra tokens at end of #ifdef directive [enabled by default]
try.c:10366:19: warning: extra tokens at end of #ifdef directive [enabled by default]
try.c:10585:19: warning: extra tokens at end of #ifdef directive [enabled by default]
try.c:10588:20: warning: extra tokens at end of #ifdef directive [enabled by default]
try.c:10591:21: warning: extra tokens at end of #ifdef directive [enabled by default]
try.c:10594:21: warning: extra tokens at end of #ifdef directive [enabled by default]
op.c: In function ‘Perl_scalarvoid’:
op.c:1177:36: warning: comparing floating point with == or != is unsafe [-Wfloat-equal]
op.c:1177:55: warning: comparing floating point with == or != is unsafe [-Wfloat-equal]
perl.c: In function ‘Perl_eval_pv’:
perl.c:2880:27: warning: comparing floating point with == or != is unsafe [-Wfloat-equal]
op.c: In function ‘S_new_logop’:
op.c:5370:26: warning: comparing floating point with == or != is unsafe [-Wfloat-equal]
op.c:5371:26: warning: comparing floating point with == or != is unsafe [-Wfloat-equal]
op.c: In function ‘Perl_newCONDOP’:
op.c:5526:20: warning: comparing floating point with == or != is unsafe [-Wfloat-equal]
op.c: In function ‘Perl_newLOOPOP’:
op.c:5673:44: warning: comparing floating point with == or != is unsafe [-Wfloat-equal]
op.c: In function ‘Perl_newWHILEOP’:
op.c:5817:46: warning: comparing floating point with == or != is unsafe [-Wfloat-equal]
perl.c: In function ‘S_init_tls_and_interp’:
perl.c:105:2: warning: ignoring return value of ‘write’, declared with attribute warn_unused_result [-Wunused-result]
perl.c: In function ‘S_forbid_setid’:
perl.c:3872:1: warning: stack protector not protecting function: all local arrays are less than 8 bytes long [-Wstack-protector]
gv.c: In function ‘Perl_Gv_AMupdate’:
gv.c:2298:14: warning: comparing floating point with == or != is unsafe [-Wfloat-equal]
gv.c: In function ‘Perl_amagic_call’:
gv.c:2710:17: warning: comparing floating point with == or != is unsafe [-Wfloat-equal]
gv.c:2979:7: warning: comparing floating point with == or != is unsafe [-Wfloat-equal]
toke.c: In function ‘S_printbuf’:
toke.c:477:5: warning: format not a string literal, argument types not checked [-Wformat-nonliteral]
toke.c: In function ‘Perl_yylex’:
toke.c:7020:12: warning: format not a string literal, argument types not checked [-Wformat-nonliteral]
toke.c: In function ‘S_pending_ident’:
toke.c:8464:17: warning: format not a string literal, argument types not checked [-Wformat-nonliteral]
toke.c: In function ‘S_new_constant’:
toke.c:8719:24: warning: comparing floating point with == or != is unsafe [-Wfloat-equal]
toke.c: In function ‘S_missingterm’:
toke.c:573:1: warning: stack protector not protecting function: all local arrays are less than 8 bytes long [-Wstack-protector]
regcomp.c: In function ‘S_make_trie’:
regcomp.c:1646:23: warning: comparing floating point with == or != is unsafe [-Wfloat-equal]
regcomp.c: In function ‘S_regclass’:
regcomp.c:10851:7: warning: ignoring return value of ‘get_regex_charset’, declared with attribute warn_unused_result [-Wunused-result]
dquote_static.c: In function ‘S_grok_bslash_c’:
dquote_static.c:45:1: warning: stack protector not protecting function: all local arrays are less than 8 bytes long [-Wstack-protector]
dump.c: In function ‘Perl_sv_peek’:
dump.c:479:13: warning: comparing floating point with == or != is unsafe [-Wfloat-equal]
dump.c:490:13: warning: comparing floating point with == or != is unsafe [-Wfloat-equal]
util.c: In function ‘Perl_my_strftime’:
util.c:4212:3: warning: format not a string literal, format string not checked [-Wformat-nonliteral]
util.c:4236:7: warning: format not a string literal, format string not checked [-Wformat-nonliteral]
util.c: In function ‘S_write_no_mem’:
util.c:67:5: warning: ignoring return value of ‘write’, declared with attribute warn_unused_result [-Wunused-result]
mg.c: In function ‘Perl_magic_setdbline’:
mg.c:2002:19: warning: comparing floating point with == or != is unsafe [-Wfloat-equal]
mg.c: In function ‘Perl_sighandler’:
mg.c:3182:9: warning: comparing floating point with == or != is unsafe [-Wfloat-equal]
hv.c: In function ‘Perl_hv_common’:
hv.c:502:10: warning: comparing floating point with == or != is unsafe [-Wfloat-equal]
av.c: In function ‘Perl_av_fetch’:
av.c:224:36: warning: comparing floating point with == or != is unsafe [-Wfloat-equal]
av.c: In function ‘Perl_av_store’:
av.c:315:24: warning: comparing floating point with == or != is unsafe [-Wfloat-equal]
av.c: In function ‘Perl_av_delete’:
av.c:855:28: warning: comparing floating point with == or != is unsafe [-Wfloat-equal]
av.c: In function ‘Perl_av_exists’:
av.c:945:28: warning: comparing floating point with == or != is unsafe [-Wfloat-equal]
av.c:968:24: warning: comparing floating point with == or != is unsafe [-Wfloat-equal]
pp_hot.c: In function ‘Perl_pp_and’:
pp_hot.c:104:10: warning: comparing floating point with == or != is unsafe [-Wfloat-equal]
pp_hot.c: In function ‘Perl_pp_cond_expr’:
pp_hot.c:217:9: warning: comparing floating point with == or != is unsafe [-Wfloat-equal]
pp_hot.c: In function ‘Perl_pp_or’:
pp_hot.c:386:9: warning: comparing floating point with == or != is unsafe [-Wfloat-equal]
pp_hot.c: In function ‘Perl_pp_grepwhile’:
pp_hot.c:2441:9: warning: comparing floating point with == or != is unsafe [-Wfloat-equal]
sv.c: In function ‘S_sv_2iuv_non_preserve’:
sv.c:1951:29: warning: comparing floating point with == or != is unsafe [-Wfloat-equal]
sv.c:1960:25: warning: comparing floating point with == or != is unsafe [-Wfloat-equal]
sv.c: In function ‘S_sv_2iuv_common’:
sv.c:2006:20: warning: comparing floating point with == or != is unsafe [-Wfloat-equal]
sv.c:2049:14: warning: comparing floating point with == or != is unsafe [-Wfloat-equal]
sv.c:2195:41: warning: comparing floating point with == or != is unsafe [-Wfloat-equal]
sv.c: In function ‘Perl_sv_2pv_flags’:
sv.c:2745:26: warning: comparing floating point with == or != is unsafe [-Wfloat-equal]
sv.c:2933:16: warning: comparing floating point with == or != is unsafe [-Wfloat-equal]
sv.c: In function ‘Perl_sv_2bool_flags’:
sv.c:3106:10: warning: comparing floating point with == or != is unsafe [-Wfloat-equal]
sv.c:3125:20: warning: comparing floating point with == or != is unsafe [-Wfloat-equal]
sv.c: In function ‘Perl_sv_inc_nomg’:
sv.c:8012:6: warning: comparing floating point with == or != is unsafe [-Wfloat-equal]
sv.c: In function ‘Perl_sv_dec_nomg’:
sv.c:8197:10: warning: comparing floating point with == or != is unsafe [-Wfloat-equal]
sv.c: In function ‘Perl_sv_true’:
sv.c:9059:20: warning: comparing floating point with == or != is unsafe [-Wfloat-equal]
sv.c: In function ‘S_F0convert’:
sv.c:10024:19: warning: comparing floating point with == or != is unsafe [-Wfloat-equal]
sv.c: In function ‘Perl_sv_vcatpvfn’:
sv.c:10883:43: warning: comparing floating point with == or != is unsafe [-Wfloat-equal]
sv.c:11027:4: warning: format not a string literal, argument types not checked [-Wformat-nonliteral]
sv.c:11028:4: warning: format not a string literal, argument types not checked [-Wformat-nonliteral]
sv.c: In function ‘Perl_sv_cat_decode’:
sv.c:13852:8: warning: comparing floating point with == or != is unsafe [-Wfloat-equal]
sv.c: In function ‘Perl_report_uninit’:
sv.c:14479:3: warning: format not a string literal, argument types not checked [-Wformat-nonliteral]
sv.c:14483:7: warning: format not a string literal, argument types not checked [-Wformat-nonliteral]
sv.c: In function ‘Perl_dirp_dup’:
sv.c:11424:11: warning: ignoring return value of ‘fchdir’, declared with attribute warn_unused_result [-Wunused-result]
sv.c:10128:7: warning: ignoring return value of ‘gcvt’, declared with attribute warn_unused_result [-Wunused-result]
sv.c:10977:7: warning: ignoring return value of ‘gcvt’, declared with attribute warn_unused_result [-Wunused-result]
sv.c:2750:3: warning: ignoring return value of ‘gcvt’, declared with attribute warn_unused_result [-Wunused-result]
sv.c:2942:6: warning: ignoring return value of ‘gcvt’, declared with attribute warn_unused_result [-Wunused-result]
pp.c: In function ‘Perl_pp_divide’:
pp.c:1498:12: warning: comparing floating point with == or != is unsafe [-Wfloat-equal]
pp.c: In function ‘Perl_pp_modulo’:
pp.c:1602:10: warning: comparing floating point with == or != is unsafe [-Wfloat-equal]
pp.c:1606:34: warning: comparing floating point with == or != is unsafe [-Wfloat-equal]
pp.c: In function ‘Perl_do_ncmp’:
pp.c:2083:15: warning: comparing floating point with == or != is unsafe [-Wfloat-equal]
pp.c: In function ‘Perl_pp_not’:
pp.c:2325:20: warning: comparing floating point with == or != is unsafe [-Wfloat-equal]
pp.c: In function ‘Perl_pp_rand’:
pp.c:2758:15: warning: comparing floating point with == or != is unsafe [-Wfloat-equal]
pp_ctl.c: In function ‘Perl_pp_formline’:
pp_ctl.c:975:3: warning: format not a string literal, argument types not checked [-Wformat-nonliteral]
pp_ctl.c: In function ‘Perl_pp_range’:
pp_ctl.c:1236:9: warning: comparing floating point with == or != is unsafe [-Wfloat-equal]
pp_ctl.c: In function ‘Perl_pp_flip’:
pp_ctl.c:1265:13: warning: comparing floating point with == or != is unsafe [-Wfloat-equal]
pp_ctl.c: In function ‘Perl_pp_flop’:
pp_ctl.c:1358:13: warning: comparing floating point with == or != is unsafe [-Wfloat-equal]
pp_ctl.c: In function ‘Perl_pp_xor’:
pp_ctl.c:1796:9: warning: comparing floating point with == or != is unsafe [-Wfloat-equal]
pp_ctl.c:1796:25: warning: comparing floating point with == or != is unsafe [-Wfloat-equal]
pp_ctl.c: In function ‘Perl_pp_return’:
pp_ctl.c:2482:44: warning: comparing floating point with == or != is unsafe [-Wfloat-equal]
pp_ctl.c: In function ‘Perl_pp_leaveeval’:
pp_ctl.c:4346:24: warning: comparing floating point with == or != is unsafe [-Wfloat-equal]
pp_ctl.c: In function ‘S_matcher_matches_sv’:
pp_ctl.c:4511:13: warning: comparing floating point with == or != is unsafe [-Wfloat-equal]
pp_ctl.c: In function ‘S_do_smartmatch’:
pp_ctl.c:4621:22: warning: comparing floating point with == or != is unsafe [-Wfloat-equal]
pp_ctl.c:4653:22: warning: comparing floating point with == or != is unsafe [-Wfloat-equal]
pp_ctl.c:4864:9: warning: comparing floating point with == or != is unsafe [-Wfloat-equal]
pp_ctl.c:4925:11: warning: comparing floating point with == or != is unsafe [-Wfloat-equal]
pp_ctl.c:4996:6: warning: comparing floating point with == or != is unsafe [-Wfloat-equal]
pp_ctl.c: In function ‘Perl_pp_enterwhen’:
pp_ctl.c:5021:52: warning: comparing floating point with == or != is unsafe [-Wfloat-equal]
sv.c: In function ‘Perl_varname’:
sv.c:13947:1: warning: stack protector not protecting function: all local arrays are less than 8 bytes long [-Wstack-protector]
pp_sys.c: In function ‘Perl_pp_stat’:
pp_sys.c:2824:3: warning: format not a string literal, argument types not checked [-Wformat-nonliteral]
pp_sys.c: In function ‘S_try_amagic_ftest’:
pp_sys.c:2966:6: warning: comparing floating point with == or != is unsafe [-Wfloat-equal]
pp_sys.c: In function ‘Perl_pp_ftis’:
pp_sys.c:3142:6: warning: comparing floating point with == or != is unsafe [-Wfloat-equal]
pp_sys.c: In function ‘Perl_pp_fttext’:
pp_sys.c:3403:3: warning: format not a string literal, argument types not checked [-Wformat-nonliteral]
pp_sys.c: In function ‘Perl_pp_gmtime’:
pp_sys.c:4513:11: warning: comparing floating point with == or != is unsafe [-Wfloat-equal]
doio.c: In function ‘Perl_do_openn’:
doio.c:538:6: warning: format not a string literal, argument types not checked [-Wformat-nonliteral]
doio.c: In function ‘Perl_my_stat_flags’:
doio.c:1320:6: warning: format not a string literal, argument types not checked [-Wformat-nonliteral]
doio.c: In function ‘Perl_my_lstat_flags’:
doio.c:1365:2: warning: format not a string literal, argument types not checked [-Wformat-nonliteral]
doio.c: In function ‘S_exec_failed’:
doio.c:1378:2: warning: ignoring return value of ‘write’, declared with attribute warn_unused_result [-Wunused-result]
doio.c: In function ‘Perl_nextargv’:
doio.c:872:7: warning: ignoring return value of ‘fchown’, declared with attribute warn_unused_result [-Wunused-result]
regexec.c: In function ‘S_regmatch’:
regexec.c:4442:11: warning: comparing floating point with == or != is unsafe [-Wfloat-equal]
utf8.c: In function ‘Perl__core_swash_init’:
utf8.c:2608:11: warning: comparing floating point with == or != is unsafe [-Wfloat-equal]
utf8.c:2631:7: warning: comparing floating point with == or != is unsafe [-Wfloat-equal]
utf8.c: In function ‘Perl_swash_fetch’:
utf8.c:2761:1: warning: stack protector not protecting function: all local arrays are less than 8 bytes long [-Wstack-protector]
utf8.c: In function ‘Perl__swash_to_invlist’:
utf8.c:3599:1: warning: stack protector not protecting function: all local arrays are less than 8 bytes long [-Wstack-protector]
taint.c: In function ‘Perl_taint_proper’:
taint.c:69:6: warning: format not a string literal, argument types not checked [-Wformat-nonliteral]
universal.c: In function ‘Perl_sv_does_sv’:
universal.c:230:15: warning: comparing floating point with == or != is unsafe [-Wfloat-equal]
universal.c: In function ‘XS_Internals_SvREADONLY’:
universal.c:908:6: warning: comparing floating point with == or != is unsafe [-Wfloat-equal]
universal.c: In function ‘XS_PerlIO_get_layers’:
universal.c:985:16: warning: comparing floating point with == or != is unsafe [-Wfloat-equal]
universal.c:991:17: warning: comparing floating point with == or != is unsafe [-Wfloat-equal]
universal.c:997:18: warning: comparing floating point with == or != is unsafe [-Wfloat-equal]
universal.c: In function ‘XS_re_regname’:
universal.c:1181:23: warning: comparing floating point with == or != is unsafe [-Wfloat-equal]
universal.c: In function ‘XS_re_regnames’:
universal.c:1214:23: warning: comparing floating point with == or != is unsafe [-Wfloat-equal]
perlio.c: In function ‘XS_PerlIO__Layer__find’:
perlio.c:969:34: warning: comparing floating point with == or != is unsafe [-Wfloat-equal]
perlio.c: In function ‘S_more_refcounted_fds’:
perlio.c:2349:2: warning: ignoring return value of ‘write’, declared with attribute warn_unused_result [-Wunused-result]
perlio.c: In function ‘PerlIO_debug’:
perlio.c:484:2: warning: ignoring return value of ‘write’, declared with attribute warn_unused_result [-Wunused-result]
perlio.c: In function ‘PerlIO_getc’:
perlio.c:4916:1: warning: stack protector not protecting function: all local arrays are less than 8 bytes long [-Wstack-protector]
numeric.c: In function ‘S_mulexp10’:
numeric.c:783:15: warning: comparing floating point with == or != is unsafe [-Wfloat-equal]
pp_sort.c: In function ‘S_sv_ncmp’:
pp_sort.c:1894:13: warning: comparing floating point with == or != is unsafe [-Wfloat-equal]
pp_sort.c:1894:27: warning: comparing floating point with == or != is unsafe [-Wfloat-equal]
pp_sort.c: In function ‘S_amagic_ncmp’:
pp_sort.c:1935:13: warning: comparing floating point with == or != is unsafe [-Wfloat-equal]
pp_sort.c: In function ‘S_amagic_i_ncmp’:
pp_sort.c:1956:13: warning: comparing floating point with == or != is unsafe [-Wfloat-equal]
pp_sort.c: In function ‘S_amagic_cmp’:
pp_sort.c:1977:13: warning: comparing floating point with == or != is unsafe [-Wfloat-equal]
pp_sort.c: In function ‘S_amagic_cmp_locale’:
pp_sort.c:1998:13: warning: comparing floating point with == or != is unsafe [-Wfloat-equal]
DynaLoader.c: In function ‘XS_DynaLoader_CLONE’:
DynaLoader.c:498:11: warning: unused variable ‘items’ [-Wunused-variable]
arybase.c: In function ‘XS_arybase_STORE’:
arybase.c:577:7: warning: unused variable ‘sv’ [-Wunused-variable]
ptable.h:168:13: warning: ‘ptable_walk’ defined but not used [-Wunused-function]
ptable.h:203:1: warning: ‘ptable_map_free’ defined but not used [-Wunused-function]
B.xs: In function ‘XS_B_walkoptree_debug’:
B.xs:742:19: warning: comparing floating point with == or != is unsafe [-Wfloat-equal]
B.c: In function ‘XS_B__COP_arybase’:
B.c:1958:9: warning: variable ‘o’ set but not used [-Wunused-but-set-variable]
B.xs: In function ‘XS_B__GV_FILEGV’:
B.xs:1867:2: warning: null argument where non-null required (argument 2) [-Wnonnull]
compress.c: In function ‘sendMTFValues’:
compress.c:243:19: warning: variable ‘nBytes’ set but not used [-Wunused-but-set-variable]
decompress.c: In function ‘BZ2_decompress’:
decompress.c:106:7: warning: stack protector not protecting function: all local arrays are less than 8 bytes long [-Wstack-protector]
bzlib.c: In function ‘default_bzalloc’:
bzlib.c:107:31: warning: unused parameter ‘opaque’ [-Wunused-parameter]
bzlib.c: In function ‘default_bzfree’:
bzlib.c:114:29: warning: unused parameter ‘opaque’ [-Wunused-parameter]
inflate.c: In function ‘inflate’:
inflate.c:589:13: warning: stack protector not protecting function: all local arrays are less than 8 bytes long [-Wstack-protector]
inflate.c: In function ‘inflateSync’:
inflate.c:1345:13: warning: stack protector not protecting function: all local arrays are less than 8 bytes long [-Wstack-protector]
Zlib.c: In function ‘XS_Compress__Raw__Zlib__inflateStream_inflate’:
Zlib.c:2192:18: warning: comparing floating point with == or != is unsafe [-Wfloat-equal]
Zlib.c:2166:7: warning: variable ‘eof’ set but not used [-Wunused-but-set-variable]
Zlib.c: In function ‘XS_Compress__Raw__Zlib__inflateStream_set_Append’:
Zlib.c:2785:20: warning: comparing floating point with == or != is unsafe [-Wfloat-equal]
Zlib.c: In function ‘XS_Compress__Raw__Zlib__inflateScanStream_scan’:
Zlib.c:2954:18: warning: comparing floating point with == or != is unsafe [-Wfloat-equal]
Zlib.c:2928:7: warning: variable ‘eof’ set but not used [-Wunused-but-set-variable]
Zlib.c:2927:7: warning: variable ‘out’ set but not used [-Wunused-but-set-variable]
Zlib.c: In function ‘XS_Compress__Raw__Zlib_constant’:
./constants.xs:38:11: warning: ‘iv’ may be used uninitialized in this function [-Wuninitialized]
Dumper.xs: In function ‘DD_dump’:
Dumper.xs:322:10: warning: comparing floating point with == or != is unsafe [-Wfloat-equal]
Dumper.xs: In function ‘XS_Data__Dumper_Dumpxs’:
Dumper.xs:1131:15: warning: comparing floating point with == or != is unsafe [-Wfloat-equal]
Dumper.xs:1153:18: warning: comparing floating point with == or != is unsafe [-Wfloat-equal]
Dumper.xs:1155:19: warning: comparing floating point with == or != is unsafe [-Wfloat-equal]
Dumper.xs:1162:13: warning: comparing floating point with == or != is unsafe [-Wfloat-equal]
DB_File.xs: In function ‘db_put’:
DB_File.xs:518:9: warning: comparison between signed and unsigned integer expressions [-Wsign-compare]
DB_File.xs: In function ‘btree_compare’:
DB_File.xs:542:20: warning: unused parameter ‘db’ [-Wunused-parameter]
DB_File.xs: In function ‘btree_prefix’:
DB_File.xs:628:19: warning: unused parameter ‘db’ [-Wunused-parameter]
DB_File.xs: In function ‘hash_cb’:
DB_File.xs:718:14: warning: unused parameter ‘db’ [-Wunused-parameter]
DB_File.xs: In function ‘db_errcall_cb’:
DB_File.xs:792:29: warning: unused parameter ‘dbenv’ [-Wunused-parameter]
DB_File.c: In function ‘XS_DB_File_DELETE’:
DB_File.c:1871:8: warning: variable ‘flags’ set but not used [-Wunused-but-set-variable]
DB_File.c: In function ‘XS_DB_File_STORE’:
DB_File.c:2064:8: warning: variable ‘flags’ set but not used [-Wunused-but-set-variable]
DB_File.xs: In function ‘boot_DB_File’:
DB_File.xs:1497:10: warning: unused variable ‘sv_err’ [-Wunused-variable]
DB_File.c: In function ‘XS_DB_File_constant’:
Peek.xs: In function ‘XS_Devel__Peek_Dump’:
Peek.xs:353:5: warning: comparing floating point with == or != is unsafe [-Wfloat-equal]
Peek.xs: In function ‘XS_Devel__Peek_DumpArray’:
Peek.xs:372:2: warning: comparing floating point with == or != is unsafe [-Wfloat-equal]
RealPPPort.xs: In function ‘XS_Devel__PPPort_ptrtests’:
RealPPPort.xs:1538:23: warning: comparing floating point with == or != is unsafe [-Wfloat-equal]
RealPPPort.xs: In function ‘XS_Devel__PPPort_ERRSV’:
RealPPPort.xs:1634:12: warning: comparing floating point with == or != is unsafe [-Wfloat-equal]
RealPPPort.xs: In function ‘XS_Devel__PPPort_other_variables’:
RealPPPort.xs:2068:3: warning: the comparison will always evaluate as ‘true’ for the address of ‘PL_no_modify’ will never be NULL [-Waddress]
MD5.xs: In function ‘XS_Digest__MD5_md5’:
MD5.xs:708:27: warning: null argument where non-null required (argument 1) [-Wnonnull]
MD5.xs:721:27: warning: null argument where non-null required (argument 1) [-Wnonnull]
src/sha.c: In function ‘shabase64’:
src/sha.c:459:27: warning: comparison between signed and unsigned integer expressions [-Wsign-compare]
src/sha.c: In function ‘encbase64’:
src/sha.c:435:13: warning: stack protector not protecting function: all local arrays are less than 8 bytes long [-Wstack-protector]
src/sha.c:451:7: warning: stack protector not protecting function: all local arrays are less than 8 bytes long [-Wstack-protector]
bsd_glob.c: In function ‘glob3’:
bsd_glob.c:732:28: warning: unused parameter ‘pattern_last’ [-Wunused-parameter]
bsd_glob.c: In function ‘globextend’:
bsd_glob.c:892:24: warning: comparison between signed and unsigned integer expressions [-Wsign-compare]
Encode.xs: In function ‘_encoded_utf8_to_bytes’:
Encode.xs:29:1: warning: unused parameter ‘sv’ [-Wunused-parameter]
Encode.xs:29:1: warning: unused parameter ‘encoding’ [-Wunused-parameter]
Encode.xs: In function ‘_encoded_bytes_to_utf8’:
Encode.xs:30:1: warning: unused parameter ‘sv’ [-Wunused-parameter]
Encode.xs:30:1: warning: unused parameter ‘encoding’ [-Wunused-parameter]
Encode.xs: In function ‘call_failure’:
Encode.xs:62:19: warning: unused parameter ‘routine’ [-Wunused-parameter]
Encode.xs:62:33: warning: unused parameter ‘done’ [-Wunused-parameter]
Encode.xs:62:44: warning: unused parameter ‘dest’ [-Wunused-parameter]
Encode.xs:62:55: warning: unused parameter ‘orig’ [-Wunused-parameter]
Encode.xs: In function ‘strict_utf8’:
Encode.xs:305:12: warning: comparing floating point with == or != is unsafe [-Wfloat-equal]
Encode.xs: In function ‘process_utf8’:
Encode.xs:356:22: warning: comparison between signed and unsigned integer expressions [-Wsign-compare]
Encode.xs:360:30: warning: comparison between signed and unsigned integer expressions [-Wsign-compare]
Encode.c: In function ‘XS_Encode__utf8_encode_xs’:
Encode.xs:499:10: warning: unused variable ‘renewed’ [-Wunused-variable]
Encode.c: In function ‘XS_Encode__XS_renew’:
Encode.c:746:7: warning: unused variable ‘obj’ [-Wunused-variable]
Encode.c: In function ‘XS_Encode__XS_renewed’:
Encode.c:765:7: warning: unused variable ‘obj’ [-Wunused-variable]
Encode.c: In function ‘XS_Encode__XS_needs_lines’:
Encode.c:948:7: warning: unused variable ‘obj’ [-Wunused-variable]
Encode.xs: In function ‘XS_Encode__XS_perlio_ok’:
Encode.xs:682:9: warning: comparing floating point with == or != is unsafe [-Wfloat-equal]
Encode.c:969:7: warning: unused variable ‘obj’ [-Wunused-variable]
Encode.xs: In function ‘XS_Encode__XS_mime_name’:
Encode.xs:699:9: warning: comparing floating point with == or != is unsafe [-Wfloat-equal]
Encode.xs: In function ‘XS_Encode__utf8_to_bytes’:
Encode.xs:762:9: warning: comparing floating point with == or != is unsafe [-Wfloat-equal]
Glob.xs: In function ‘iterate’:
Glob.xs:100:2: warning: value computed is not used [-Wunused-value]
Glob.xs:108:6: warning: value computed is not used [-Wunused-value]
Call.xs: In function ‘filter_call’:
Call.xs:63:3: warning: format ‘%d’ expects argument of type ‘int’, but argument 3 has type ‘STRLEN’ [-Wformat]
Call.xs:63:3: warning: format ‘%d’ expects argument of type ‘int’, but argument 5 has type ‘STRLEN’ [-Wformat]
Call.xs:100:5: warning: format ‘%d’ expects argument of type ‘int’, but argument 4 has type ‘STRLEN’ [-Wformat]
Call.xs:156:8: warning: format ‘%d’ expects argument of type ‘int’, but argument 3 has type ‘STRLEN’ [-Wformat]
Call.xs:175:48: warning: signed and unsigned type in conditional expression [-Wsign-compare]
Call.xs:175:14: warning: format ‘%d’ expects argument of type ‘int’, but argument 4 has type ‘STRLEN’ [-Wformat]
Call.xs:186:47: warning: signed and unsigned type in conditional expression [-Wsign-compare]
Call.c: In function ‘XS_Filter__Util__Call_unimport’:
Call.c:442:15: warning: variable ‘package’ set but not used [-Wunused-but-set-variable]
IO.c: In function ‘XS_IO__Handle__create_getline_subs’:
IO.xs:488:6: warning: unused variable ‘ret’ [-Wunused-variable]
SysV.c: In function ‘XS_IPC__SysV__constant’:
./const-xs.inc:38:11: warning: ‘iv’ may be used uninitialized in this function [-Wuninitialized]
ListUtil.xs: In function ‘XS_List__Util_min’:
ListUtil.xs:159:18: warning: comparing floating point with == or != is unsafe [-Wfloat-equal]
ListUtil.xs: In function ‘XS_List__Util_reduce’:
ListUtil.xs:281:5: warning: variable ‘newsp’ set but not used [-Wunused-but-set-variable]
ListUtil.xs: In function ‘XS_List__Util_first’:
ListUtil.xs:341:6: warning: comparing floating point with == or != is unsafe [-Wfloat-equal]
ListUtil.xs:320:5: warning: variable ‘newsp’ set but not used [-Wunused-but-set-variable]
ListUtil.c: In function ‘XS_List__Util_min’:
ListUtil.xs:173:20: warning: ‘retval’ may be used uninitialized in this function [-Wuninitialized]
Base64.xs: In function ‘XS_MIME__QuotedPrint_encode_qp’:
Base64.xs:347:25: warning: comparing floating point with == or != is unsafe [-Wfloat-equal]
Base64.c: In function ‘XS_MIME__QuotedPrint_decode_qp’:
Base64.c:640:1: warning: stack protector not protecting function: all local arrays are less than 8 bytes long [-Wstack-protector]
Base64.c: In function ‘XS_MIME__Base64_decode_base64’:
Base64.c:345:1: warning: stack protector not protecting function: all local arrays are less than 8 bytes long [-Wstack-protector]
Opcode.xs: In function ‘XS_Opcode__safe_pkg_prep’:
Opcode.xs:264:9: warning: null argument where non-null required (argument 1) [-Wnonnull]
encoding.xs: In function ‘PerlIOEncode_pushed’:
encoding.xs:121:51: warning: comparing floating point with == or != is unsafe [-Wfloat-equal]
encoding.xs:135:57: warning: comparing floating point with == or != is unsafe [-Wfloat-equal]
encoding.xs:144:10: warning: comparing floating point with == or != is unsafe [-Wfloat-equal]
scalar.xs: In function ‘PerlIOScalar_write’:
scalar.xs:175:18: warning: comparison between signed and unsigned integer expressions [-Wsign-compare]
via.xs: In function ‘PerlIOVia_method’:
via.xs:90:12: warning: null argument where non-null required (argument 2) [-Wnonnull]
via.xs: In function ‘PerlIOVia_pushed’:
via.xs:175:17: warning: comparing floating point with == or != is unsafe [-Wfloat-equal]
via.xs: In function ‘PerlIOVia_open’:
via.xs:247:16: warning: comparing floating point with == or != is unsafe [-Wfloat-equal]
POSIX.xs: In function ‘is_common’:
POSIX.xs:705:9: warning: unused variable ‘charstring’ [-Wunused-variable]
POSIX.xs: In function ‘XS_POSIX_sigaction’:
POSIX.xs:1294:9: warning: comparing floating point with == or != is unsafe [-Wfloat-equal]
POSIX.xs:1326:6: warning: comparing floating point with == or != is unsafe [-Wfloat-equal]
POSIX.xs:1366:4: warning: comparing floating point with == or != is unsafe [-Wfloat-equal]
POSIX.xs:556:1: warning: ‘not_here’ defined but not used [-Wunused-function]
POSIX.c: In function ‘XS_POSIX__Termios_getiflag’:
POSIX.c:1214:13: warning: ‘RETVAL’ may be used uninitialized in this function [-Wuninitialized]
re_exec.c: In function ‘S_regmatch’:
re_exec.c:4442:11: warning: comparing floating point with == or != is unsafe [-Wfloat-equal]
re_comp.c: In function ‘S_make_trie’:
re_comp.c:1646:23: warning: comparing floating point with == or != is unsafe [-Wfloat-equal]
re_comp.c:6386:1: warning: ‘S__new_invlist_C_array’ defined but not used [-Wunused-function]
re_comp.c:6410:1: warning: ‘S_invlist_extend’ defined but not used [-Wunused-function]
../../proto.h:6381:11: warning: ‘S_invlist_search’ declared ‘static’ but never defined [-Wunused-function]
re_comp.c: In function ‘S_regclass’:
re_comp.c:10851:7: warning: ignoring return value of ‘get_regex_charset’, declared with attribute warn_unused_result [-Wunused-result]
Unicode.xs: In function ‘XS_Encode__Unicode_decode_xs’:
Unicode.xs:175:6: warning: comparing floating point with == or != is unsafe [-Wfloat-equal]
Unicode.xs:176:6: warning: value computed is not used [-Wunused-value]
Unicode.xs:194:10: warning: comparing floating point with == or != is unsafe [-Wfloat-equal]
Unicode.xs: In function ‘XS_Encode__Unicode_encode_xs’:
Unicode.xs:333:6: warning: comparing floating point with == or != is unsafe [-Wfloat-equal]
Unicode.xs:334:6: warning: value computed is not used [-Wunused-value]
Unicode.xs:349:14: warning: comparing floating point with == or != is unsafe [-Wfloat-equal]
sdbm.c: In function ‘makroom’:
sdbm.c:371:2: warning: ignoring return value of ‘write’, declared with attribute warn_unused_result [-Wunused-result]
SDBM_File.c: In function ‘XS_SDBM_File_NEXTKEY’:
SDBM_File.c:469:12: warning: variable ‘key’ set but not used [-Wunused-but-set-variable]
Socket.c: In function ‘XS_Socket_inet_ntop’:
Socket.xs:874:18: warning: variable ‘struct_size’ set but not used [-Wunused-but-set-variable]
Storable.xs: In function ‘store_hash’:
Storable.xs:2284:5: warning: comparing floating point with == or != is unsafe [-Wfloat-equal]
Storable.xs: In function ‘store_code’:
Storable.xs:2572:4: warning: comparing floating point with == or != is unsafe [-Wfloat-equal]
Storable.xs: In function ‘store_other’:
Storable.xs:3353:4: warning: comparing floating point with == or != is unsafe [-Wfloat-equal]
Storable.xs: In function ‘retrieve_hook’:
Storable.xs:4035:2: warning: null argument where non-null required (argument 2) [-Wnonnull]
Storable.xs: In function ‘retrieve_code’:
Storable.xs:5355:7: warning: comparing floating point with == or != is unsafe [-Wfloat-equal]
Storable.xs:5359:5: warning: comparing floating point with == or != is unsafe [-Wfloat-equal]
Storable.xs:5389:6: warning: comparing floating point with == or != is unsafe [-Wfloat-equal]
Storable.xs: In function ‘old_retrieve_array’:
Storable.xs:5440:2: warning: null argument where non-null required (argument 2) [-Wnonnull]
Storable.xs: In function ‘old_retrieve_hash’:
Storable.xs:5503:2: warning: null argument where non-null required (argument 2) [-Wnonnull]
Storable.xs: In function ‘magic_check’:
Storable.xs:5689:24: warning: comparing floating point with == or != is unsafe [-Wfloat-equal]
Storable.xs: In function ‘retrieve’:
Storable.xs:5860:24: warning: comparing floating point with == or != is unsafe [-Wfloat-equal]
Storable.xs:1587:12: warning: ‘is_storing’ defined but not used [-Wunused-function]
Storable.xs:1599:12: warning: ‘is_retrieving’ defined but not used [-Wunused-function]
threads.xs:394:1: warning: missing initializer [-Wmissing-field-initializers]
threads.xs:394:1: warning: (near initialization for ‘ithread_vtbl.svt_local’) [-Wmissing-field-initializers]
threads.xs: In function ‘S_ithread_run’:
threads.xs:549:13: warning: comparing floating point with == or != is unsafe [-Wfloat-equal]
threads.xs: In function ‘XS_threads_create’:
threads.xs:1017:25: warning: comparing floating point with == or != is unsafe [-Wfloat-equal]
threads.xs:1057:21: warning: comparing floating point with == or != is unsafe [-Wfloat-equal]
threads.xs:1061:21: warning: comparing floating point with == or != is unsafe [-Wfloat-equal]
threads.xs:1065:21: warning: comparing floating point with == or != is unsafe [-Wfloat-equal]
threads.xs:1069:21: warning: comparing floating point with == or != is unsafe [-Wfloat-equal]
threads.xs: In function ‘XS_threads_list’:
threads.xs:1129:28: warning: comparing floating point with == or != is unsafe [-Wfloat-equal]
threads.xs: In function ‘XS_threads_set_thread_exit_only’:
threads.xs:1661:13: warning: comparing floating point with == or != is unsafe [-Wfloat-equal]
threads.c: In function ‘S_ithread_create’:
threads.xs:714:9: warning: ignoring return value of ‘write’, declared with attribute warn_unused_result [-Wunused-result]
threads.xs:471:9: warning: variable ‘exit_app’ might be clobbered by ‘longjmp’ or ‘vfork’ [-Wclobbered]
threads.xs:472:9: warning: variable ‘exit_code’ might be clobbered by ‘longjmp’ or ‘vfork’ [-Wclobbered]
threads.xs:499:13: warning: variable ‘len’ might be clobbered by ‘longjmp’ or ‘vfork’ [-Wclobbered]
NamedCapture.xs: In function ‘XS_Tie__Hash__NamedCapture_TIEHASH’:
NamedCapture.xs:56:10: warning: comparing floating point with == or != is unsafe [-Wfloat-equal]
Piece.xs: In function ‘_strptime’:
Piece.xs:682:18: warning: comparison between signed and unsigned integer expressions [-Wsign-compare]
Piece.xs:776:18: warning: comparison between signed and unsigned integer expressions [-Wsign-compare]
Piece.xs: In function ‘our_strptime’:
Piece.xs:950:8: warning: unused variable ‘ret’ [-Wunused-variable]
Piece.xs: In function ‘XS_Time__Piece__strftime’:
Piece.xs:989:9: warning: format not a string literal, format string not checked [-Wformat-nonliteral]
Piece.xs:1004:29: warning: comparison between signed and unsigned integer expressions [-Wsign-compare]
Piece.xs:1015:13: warning: format not a string literal, format string not checked [-Wformat-nonliteral]
Piece.xs:345:13: warning: ‘copyright’ defined but not used [-Wunused-variable]
Piece.xs:347:13: warning: ‘sccsid’ defined but not used [-Wunused-variable]
HiRes.c: In function ‘XS_Time__HiRes_constant’:
Collate.xs: In function ‘XS_Unicode__Collate_mk_SortKey’:
Collate.xs:445:22: warning: comparing floating point with == or != is unsafe [-Wfloat-equal]
Collate.xs:447:20: warning: comparing floating point with == or != is unsafe [-Wfloat-equal]
Collate.xs: In function ‘XS_Unicode__Collate_varCE’:
Collate.xs:572:19: warning: comparing floating point with == or != is unsafe [-Wfloat-equal]
Collate.xs:597:2: warning: statement with no effect [-Wunused-value]
Collate.xs:607:2: warning: statement with no effect [-Wunused-value]
Normalize.xs: In function ‘XS_Unicode__Normalize_decompose’:
Normalize.xs:458:55: warning: comparing floating point with == or != is unsafe [-Wfloat-equal]
Normalize.c: In function ‘XS_Unicode__Normalize_isComp2nd’:
Normalize.c:1086:5: warning: unused variable ‘ix’ [-Wunused-variable]
APItest.xs:262:1: warning: missing initializer [-Wmissing-field-initializers]
APItest.xs:262:1: warning: (near initialization for ‘rmagical_b.svt_set’) [-Wmissing-field-initializers]
APItest.xs: In function ‘THX_keyword_active’:
APItest.xs:951:18: warning: comparing floating point with == or != is unsafe [-Wfloat-equal]
APItest.xs: In function ‘filter_call’:
APItest.xs:1050:11: warning: unused variable ‘my_sv’ [-Wunused-variable]
APItest.xs: In function ‘addissub_myck_add’:
APItest.xs:1090:23: warning: comparing floating point with == or != is unsafe [-Wfloat-equal]
APItest.c: In function ‘XS_XS__APItest__AutoLoader_AUTOLOADp’:
APItest.c:2377:11: warning: unused variable ‘items’ [-Wunused-variable]
APItest.c: In function ‘XS_XS__APItest_my_cxt_getsv’:
APItest.c:3572:19: warning: comparing floating point with == or != is unsafe [-Wfloat-equal]
APItest.xs: In function ‘XS_XS__APItest_rmagical_cast’:
APItest.xs:2211:6: warning: comparing floating point with == or != is unsafe [-Wfloat-equal]
APItest.c: In function ‘XS_XS__APItest_bhk_record’:
APItest.c:3983:18: warning: comparing floating point with == or != is unsafe [-Wfloat-equal]
APItest.c: In function ‘XS_XS__APItest_test_rv2cv_op_cv’:
APItest.xs:2449:16: warning: variable ‘wibble_gv’ set but not used [-Wunused-but-set-variable]
APItest.xs: In function ‘XS_XS__APItest_multicall_each’:
APItest.xs:2994:5: warning: variable ‘newsp’ set but not used [-Wunused-but-set-variable]
APItest.c: In function ‘XS_XS__APItest_stringify’:
APItest.xs:3261:17: warning: variable ‘pv’ set but not used [-Wunused-but-set-variable]
APItest.c: In function ‘XS_XS__APItest_xs_cmp_undef’:
APItest.c:5496:7: warning: unused variable ‘b’ [-Wunused-variable]
APItest.c:5494:7: warning: unused variable ‘a’ [-Wunused-variable]
APItest.c: In function ‘XS_XS__APItest__AUTOLOADtest_AUTOLOAD’:
APItest.xs:3321:9: warning: unused variable ‘tmp’ [-Wunused-variable]
APItest.c:5566:11: warning: unused variable ‘items’ [-Wunused-variable]
Typemap.c: In function ‘XS_XS__Typemap_T_BOOL’:
Typemap.c:791:18: warning: comparing floating point with == or != is unsafe [-Wfloat-equal]
FastCalc.xs: In function ‘XS_Math__BigInt__FastCalc___strip_zeros’:
FastCalc.xs:167:22: warning: comparing floating point with == or != is unsafe [-Wfloat-equal]
FastCalc.xs: In function ‘XS_Math__BigInt__FastCalc__acmp’:
FastCalc.xs:395:19: warning: comparing floating point with == or != is unsafe [-Wfloat-equal]
APItest.c: In function ‘XS_XS__APItest_whichsig_type’:
APItest.xs:2090:9: warning: ‘i’ may be used uninitialized in this function [-Wuninitialized]
APItest.c: In function ‘XS_XS__APItest_gv_autoload_type’:
APItest.xs:2065:2: warning: ‘gv’ may be used uninitialized in this function [-Wuninitialized]
APItest.c: In function ‘XS_XS__APItest_gv_fetchmethod_flags_type’:
APItest.xs:2037:2: warning: ‘gv’ may be used uninitialized in this function [-Wuninitialized]
APItest.c: In function ‘XS_XS__APItest_gv_fetchmeth_autoload_type’:
APItest.xs:2009:2: warning: ‘gv’ may be used uninitialized in this function [-Wuninitialized]
APItest.c: In function ‘XS_XS__APItest_gv_fetchmeth_type’:
APItest.xs:1981:2: warning: ‘gv’ may be used uninitialized in this function [-Wuninitialized]
APItest.c: In function ‘XS_XS__APItest_newCONSTSUB_type’:
APItest.xs:1922:9: warning: ‘cv’ may be used uninitialized in this function [-Wuninitialized]
a2py.c: In function ‘main’:
a2py.c:62:75: warning: unused parameter ‘env’ [-Wunused-parameter]
ExtTest.c: In function ‘XS_ExtTest_constant’:
ExtTest.xs:465:11: warning: ‘pv’ may be used uninitialized in this function [-Wuninitialized]
ExtTest.xs:418:6: warning: ‘iv’ may be used uninitialized in this function [-Wuninitialized]
ExtTest.xs:236:11: warning: ‘iv’ may be used uninitialized in this function [-Wuninitialized]
ExtTest.xs:217:11: warning: ‘iv’ may be used uninitialized in this function [-Wuninitialized]
XSMore.c: In function ‘XS_XSMore_nil’:
XSMore.c:493:4: warning: unused variable ‘items’ [-Wunused-variable]
XSUsage.c: In function ‘XS_XSUsage_two’:
XSUsage.c:200:5: warning: unused variable ‘ix’ [-Wunused-variable]
XSUsage.c: In function ‘XS_XSUsage_four’:
XSUsage.c:236:11: warning: unused variable ‘items’ [-Wunused-variable]

-- 
Report by Test::Smoke v1.44 build 1285 running on perl 5.14.2
(Reporter v0.035 / Smoker v0.045)



nntp.perl.org: Perl Programming lists via nntp and http.
Comments to Ask Bjørn Hansen at ask@perl.org | Group listing | About