develooper Front page | perl.daily-build.reports | Postings from February 2012

Smoke [blead] v5.15.8-47-g55d3f3e FAIL(F) MSWin32 Win2000 SP4 (x86/1 cpu)

From:
George Greer
Date:
February 27, 2012 12:44
Subject:
Smoke [blead] v5.15.8-47-g55d3f3e FAIL(F) MSWin32 Win2000 SP4 (x86/1 cpu)
Message ID:
20120227204438.EE3744E0E0C@zwei
Smoke logs available at http://m-l.org/~perl/smoke/perl/

Automated smoke report for 5.15.8 patch 55d3f3e53492b8cc2dcf2c5ff35f6b379b1685e8 v5.15.8-47-g55d3f3e
perl-win2k: Intel(R) Core(TM) i7 CPU 920 @ 2.67GHz(~38641 MHz) (x86/1 cpu)
    on        MSWin32 - Win2000 SP4
    using     cl version 14.00.50727.762
    smoketime 8 hours 24 minutes (average 2 hours 6 minutes)

Summary: FAIL(F)

O = OK  F = Failure(s), extended report at the bottom
X = Failure(s) under TEST but not under harness
? = still running or test results not (yet) available
Build failures during:       - = unknown or N/A
c = Configure, m = make, M = make (after miniperl), t = make test-prep

v5.15.8-47-g55d3f3e  Configuration (common) none
----------- ---------------------------------------------------------
F F         
F F         -Duseithreads
| +--------- -DDEBUGGING
+----------- no debugging


Locally applied patches:
    uncommitted-changes
    SMOKE55d3f3e53492b8cc2dcf2c5ff35f6b379b1685e8

Failures: (common-args) none
[default] 
../t/op/alarm.t.............................................FAILED
    4
../cpan/Memoize/t/expmod_t.t................................FAILED
    11-12, 15
../cpan/Time-HiRes/t/usleep.t...............................FAILED
    3-6
    Non-zero exit status: 4
../ext/Pod-Html/t/crossref2.t...............................FAILED
    1
    Non-zero exit status: 1

[default] -DDEBUGGING
../t/op/alarm.t.............................................FAILED
    2
../cpan/Memoize/t/expmod_t.t................................FAILED
    11-12, 15
../cpan/Time-HiRes/t/usleep.t...............................FAILED
    3-6
    Non-zero exit status: 4
../ext/Pod-Html/t/crossref2.t...............................FAILED
    1
    Non-zero exit status: 1

[default] -Duseithreads
../t/op/fork.t..............................................FAILED
    16
../cpan/Memoize/t/expmod_t.t................................FAILED
    11-12, 15
../cpan/Time-HiRes/t/usleep.t...............................FAILED
    3-6
    Non-zero exit status: 4
../ext/Pod-Html/t/crossref2.t...............................FAILED
    1
    Non-zero exit status: 1

[default] -DDEBUGGING -Duseithreads
../t/op/fork.t..............................................FAILED
    16
../t/op/threads.t...........................................FAILED
    Non-zero exit status: 9
    Bad plan.  You planned 26 tests but ran 9.
../cpan/Memoize/t/expmod_t.t................................FAILED
    11-12, 15
../cpan/Time-HiRes/t/usleep.t...............................FAILED
    3-6
    Non-zero exit status: 4
../ext/Pod-Html/t/crossref2.t...............................FAILED
    1
    Non-zero exit status: 1

Passed Todo tests: (common-args) none
[default] 
[default] -DDEBUGGING
[default] -Duseithreads
[default] -DDEBUGGING -Duseithreads
../cpan/CGI/t/tmpdir.t......................................PASSED
    3-9

Compiler messages(MSWin32):
op.c(6480) : warning C4244: 'initializing' : conversion from 'U32' to 'const char', possible loss of data
op.c(10576) : warning C4028: formal parameter 1 different from declaration
..\pp.c(5978) : warning C4244: 'function' : conversion from 'U32' to 'const char', possible loss of data
..\pp_hot.c(2685) : warning C4244: 'initializing' : conversion from 'I32' to 'U8', possible loss of data
..\pp_sort.c(1668) : warning C4244: 'initializing' : conversion from 'I32' to 'U8', possible loss of data
..\toke.c(761) : warning C4244: '=' : conversion from 'U32' to 'U8', possible loss of data
IO.xs(488) : warning C4101: 'ret' : unreferenced local variable
ListUtil.xs(297) : warning C4244: 'initializing' : conversion from 'I32' to 'U8', possible loss of data
ListUtil.xs(335) : warning C4244: 'initializing' : conversion from 'I32' to 'U8', possible loss of data
Base64.xs(394) : warning C4146: unary minus operator applied to unsigned type, result still unsigned
Base64.xs(396) : warning C4146: unary minus operator applied to unsigned type, result still unsigned
POSIX.xs(705) : warning C4101: 'charstring' : unreferenced local variable
scalar.xs(175) : warning C4018: '>' : signed/unsigned mismatch
Piece.xs(950) : warning C4101: 'ret' : unreferenced local variable
APItest.xs(3009) : warning C4244: 'initializing' : conversion from 'I32' to 'U8', possible loss of data
APItest.xs(3321) : warning C4101: 'tmp' : unreferenced local variable
op.c(10576) : warning C4028: formal parameter 2 different from declaration

-- 
Report by Test::Smoke v1.42 build 1267 running on perl 5.10.0
(Reporter v0.035 / Smoker v0.045)




nntp.perl.org: Perl Programming lists via nntp and http.
Comments to Ask Bjørn Hansen at ask@perl.org | Group listing | About