develooper Front page | perl.daily-build.reports | Postings from February 2012

Smoke [5.15.8] v5.15.8-36-g509a2f6 FAIL(F) cygwin_nt-5.2-wow64 1.7.11(0.260/5/3) (AMD64/2 cpu)

From:
tony
Date:
February 27, 2012 08:15
Subject:
Smoke [5.15.8] v5.15.8-36-g509a2f6 FAIL(F) cygwin_nt-5.2-wow64 1.7.11(0.260/5/3) (AMD64/2 cpu)
Message ID:
201202271614.q1RGEQoq021177@mars.tony.develop-help.com
Automated smoke report for 5.15.8 patch 509a2f669223ac7ed75b674fa9b8bea43665a039 v5.15.8-36-g509a2f6
pluto: AMD Athlon(tm) 64 X2 Dual Core Processor 5200+(~2613 MHz) (AMD64/2 cpu)
    on        cygwin_nt-5.2-wow64 - 1.7.11(0.260/5/3)
    using     ccache gcc version 4.5.3
    smoketime 14 hours 29 minutes (average 3 hours 37 minutes)

Summary: FAIL(F)

O = OK  F = Failure(s), extended report at the bottom
X = Failure(s) under TEST but not under harness
? = still running or test results not (yet) available
Build failures during:       - = unknown or N/A
c = Configure, m = make, M = make (after miniperl), t = make test-prep

v5.15.8-36-g509a2f6  Configuration (common) -Dcc='ccache gcc'
----------- ---------------------------------------------------------
F F F F     -Uusethreads -Uuseithreads
F F F F     -Duseithreads -Uusemymalloc
| | | +----- PERLIO = perlio -DDEBUGGING
| | +------- PERLIO = stdio  -DDEBUGGING
| +--------- PERLIO = perlio
+----------- PERLIO = stdio


Locally applied patches:
    uncommitted-changes
    SMOKE509a2f669223ac7ed75b674fa9b8bea43665a039

Testsuite was run only with 'harness' and HARNESS_OPTIONS=j3

Failures: (common-args) -Dcc='ccache gcc'
[stdio] -Uusethreads -Uuseithreads
../t/io/shm.t...............................................FAILED
    Non-zero exit status: 88
    No plan found in TAP output
../t/op/alarm.t.............................................FAILED
    1-2
../t/op/sigdispatch.t.......................................FAILED
    Bad plan.  You planned 26 tests but ran 0.
../t/op/taint.t.............................................FAILED
    Bad plan.  You planned 793 tests but ran 537.
../cpan/Time-HiRes/t/alarm.t................................FAILED
    5-6
../cpan/Time-HiRes/t/ualarm.t...............................FAILED
    1, 5-6
    Non-zero exit status: 3
../cpan/Win32/t/Unicode.t...................................FAILED
    4
../cpan/Win32API-File/t/file.t..............................FAILED
    Non-zero exit status: 2
    Bad plan.  You planned 267 tests but ran 49.
../dist/Net-Ping/t/500_ping_icmp.t..........................FAILED
    2
    Non-zero exit status: 1
../dist/Net-Ping/t/510_ping_udp.t...........................FAILED
    2
    Non-zero exit status: 1
../ext/XS-APItest/t/call_checker.t..........................FAILED
    Non-zero exit status: 255
    Bad plan.  You planned 64 tests but ran 0.

[perlio] -Uusethreads -Uuseithreads
../t/io/shm.t...............................................FAILED
    Non-zero exit status: 88
    No plan found in TAP output
../t/op/sigdispatch.t.......................................FAILED
    Bad plan.  You planned 26 tests but ran 0.
../t/op/alarm.t.............................................FAILED
    1-2
../t/op/taint.t.............................................FAILED
    Bad plan.  You planned 793 tests but ran 537.
../cpan/Time-HiRes/t/alarm.t................................FAILED
    5-6, 9
    Non-zero exit status: 3
../cpan/Time-HiRes/t/ualarm.t...............................FAILED
    1, 6
    Non-zero exit status: 2
../ext/XS-APItest/t/call_checker.t..........................FAILED
    Non-zero exit status: 255
    Bad plan.  You planned 64 tests but ran 0.
../dist/Net-Ping/t/500_ping_icmp.t..........................FAILED
    2
    Non-zero exit status: 1
../dist/Net-Ping/t/510_ping_udp.t...........................FAILED
    2
    Non-zero exit status: 1
../cpan/Win32/t/Unicode.t...................................FAILED
    4
../cpan/Win32API-File/t/file.t..............................FAILED
    Non-zero exit status: 2
    Bad plan.  You planned 267 tests but ran 49.
../ext/Win32CORE/t/win32core.t..............................FAILED
    3
    Non-zero exit status: 1

[stdio] -DDEBUGGING -Uusethreads -Uuseithreads
../t/io/shm.t...............................................FAILED
    Non-zero exit status: 88
    No plan found in TAP output
../t/op/alarm.t.............................................FAILED
    1-2
../t/op/sigdispatch.t.......................................FAILED
    Bad plan.  You planned 26 tests but ran 0.
../t/op/taint.t.............................................FAILED
    Bad plan.  You planned 793 tests but ran 537.
../cpan/IPC-Cmd/t/01_IPC-Cmd.t..............................FAILED
    461-462
    Non-zero exit status: 2
../cpan/Time-HiRes/t/alarm.t................................FAILED
    5-6
../cpan/Time-HiRes/t/ualarm.t...............................FAILED
    5-6
    Non-zero exit status: 2
../cpan/Win32/t/Unicode.t...................................FAILED
    4
../cpan/Win32API-File/t/file.t..............................FAILED
    Non-zero exit status: 2
    Bad plan.  You planned 267 tests but ran 49.
../dist/I18N-Collate/t/I18N-Collate.t.......................FAILED
    6-7
    Non-zero exit status: 2
../dist/Net-Ping/t/500_ping_icmp.t..........................FAILED
    2
    Non-zero exit status: 1
../dist/Net-Ping/t/510_ping_udp.t...........................FAILED
    2
    Non-zero exit status: 1
../ext/XS-APItest/t/call_checker.t..........................FAILED
    Non-zero exit status: 255
    Bad plan.  You planned 64 tests but ran 0.

[perlio] -DDEBUGGING -Uusethreads -Uuseithreads
../t/io/shm.t...............................................FAILED
    Non-zero exit status: 88
    No plan found in TAP output
../t/op/sigdispatch.t.......................................FAILED
    Bad plan.  You planned 26 tests but ran 0.
../t/op/alarm.t.............................................FAILED
    1-2
../t/op/taint.t.............................................FAILED
    Bad plan.  You planned 793 tests but ran 537.
../cpan/Time-HiRes/t/alarm.t................................FAILED
    5-6
../cpan/Time-HiRes/t/ualarm.t...............................FAILED
    1, 5-6
    Non-zero exit status: 3
../ext/XS-APItest/t/call_checker.t..........................FAILED
    Non-zero exit status: 255
    Bad plan.  You planned 64 tests but ran 0.
../dist/Net-Ping/t/500_ping_icmp.t..........................FAILED
    2
    Non-zero exit status: 1
../dist/Net-Ping/t/510_ping_udp.t...........................FAILED
    2
    Non-zero exit status: 1
../cpan/Win32/t/Unicode.t...................................FAILED
    4
../cpan/Win32API-File/t/file.t..............................FAILED
    Non-zero exit status: 2
    Bad plan.  You planned 267 tests but ran 49.
../ext/Win32CORE/t/win32core.t..............................FAILED
    3
    Non-zero exit status: 1
../dist/I18N-Collate/t/I18N-Collate.t.......................FAILED
    6-7
    Non-zero exit status: 2

[stdio] -Duseithreads -Uusemymalloc
../t/io/shm.t...............................................FAILED
    Non-zero exit status: 88
    No plan found in TAP output
../t/re/pat_rt_report_thr.t.................................FAILED
    Bad plan.  You planned 2521 tests but ran 0.
../t/re/reg_email_thr.t.....................................FAILED
    No plan found in TAP output
../t/re/regexp_qr_embed_thr.t...............................FAILED
    Bad plan.  You planned 1578 tests but ran 8.
../t/op/alarm.t.............................................FAILED
    2
../t/op/reset.t.............................................FAILED
    22-23
../t/op/sigdispatch.t.......................................FAILED
    Bad plan.  You planned 26 tests but ran 0.
../t/op/taint.t.............................................FAILED
    Bad plan.  You planned 793 tests but ran 537.
../t/op/threads.t...........................................FAILED
    Bad plan.  You planned 26 tests but ran 9.
../cpan/Digest-MD5/t/threads.t..............................FAILED
    Bad plan.  You planned 2 tests but ran 0.
../cpan/Time-HiRes/t/alarm.t................................FAILED
    Non-zero exit status: 4
    Bad plan.  You planned 10 tests but ran 3.
../cpan/Time-HiRes/t/ualarm.t...............................FAILED
    1
    Non-zero exit status: 1
../cpan/Win32/t/Unicode.t...................................FAILED
    4
../cpan/Win32API-File/t/file.t..............................FAILED
    Non-zero exit status: 2
    Bad plan.  You planned 267 tests but ran 49.
../dist/Net-Ping/t/500_ping_icmp.t..........................FAILED
    2
    Non-zero exit status: 1
../dist/Net-Ping/t/510_ping_udp.t...........................FAILED
    2
    Non-zero exit status: 1
../dist/Thread-Queue/t/01_basic.t...........................FAILED
    Bad plan.  You planned 81 tests but ran 2.
../dist/Thread-Queue/t/02_refs.t............................FAILED
    Bad plan.  You planned 46 tests but ran 6.
../dist/Thread-Queue/t/03_peek.t............................FAILED
    Bad plan.  You planned 19 tests but ran 1.
../dist/Thread-Queue/t/07_lock.t............................FAILED
    Bad plan.  You planned 3 tests but ran 1.
../dist/Thread-Semaphore/t/01_basic.t.......................FAILED
    Bad plan.  You planned 10 tests but ran 2.
../dist/Thread-Semaphore/t/04_nonblocking.t.................FAILED
    Bad plan.  You planned 12 tests but ran 2.
../dist/Thread-Semaphore/t/05_force.t.......................FAILED
    Bad plan.  You planned 8 tests but ran 2.
../dist/Storable/t/threads.t................................FAILED
    Bad plan.  You planned 2 tests but ran 0.
../dist/threads-shared/t/av_refs.t..........................FAILED
    Bad plan.  You planned 14 tests but ran 3.
../dist/threads-shared/t/av_simple.t........................FAILED
    Bad plan.  You planned 44 tests but ran 9.
../dist/threads-shared/t/blessed.t..........................FAILED
    Bad plan.  You planned 37 tests but ran 1.
../dist/threads-shared/t/clone.t............................FAILED
    Bad plan.  You planned 34 tests but ran 4.
../dist/threads-shared/t/cond.t.............................FAILED
    Bad plan.  You planned 32 tests but ran 2.
../dist/threads-shared/t/hv_refs.t..........................FAILED
    Bad plan.  You planned 20 tests but ran 3.
../dist/threads-shared/t/no_share.t.........................FAILED
    Bad plan.  You planned 6 tests but ran 3.
../dist/threads-shared/t/object.t...........................FAILED
    Bad plan.  You planned 28 tests but ran 5.
../dist/threads-shared/t/object2.t..........................FAILED
    Bad plan.  You planned 122 tests but ran 121.
../dist/threads-shared/t/shared_attr.t......................FAILED
    Bad plan.  You planned 101 tests but ran 2.
../dist/threads/t/basic.t...................................FAILED
    Bad plan.  You planned 34 tests but ran 2.
../dist/threads/t/blocks.t..................................FAILED
    Bad plan.  You planned 5 tests but ran 0.
../dist/threads/t/context.t.................................FAILED
    Bad plan.  You planned 31 tests but ran 1.
../dist/threads-shared/t/stress.t...........................FAILED
    1
../dist/threads/t/end.t.....................................FAILED
    Bad plan.  You planned 6 tests but ran 1.
../dist/threads-shared/t/sv_simple.t........................FAILED
    Bad plan.  You planned 11 tests but ran 3.
../dist/threads/t/exit.t....................................FAILED
    Bad plan.  You planned 18 tests but ran 1.
../dist/threads/t/free2.t...................................FAILED
    Bad plan.  You planned 78 tests but ran 0.
../dist/threads/t/join.t....................................FAILED
    Bad plan.  You planned 20 tests but ran 1.
../dist/threads/t/kill.t....................................FAILED
    No plan found in TAP output
../dist/threads/t/kill2.t...................................FAILED
    No plan found in TAP output
../dist/threads/t/libc.t....................................FAILED
    Bad plan.  You planned 11 tests but ran 1.
../dist/threads/t/stack.t...................................FAILED
    Bad plan.  You planned 18 tests but ran 4.
../dist/threads/t/state.t...................................FAILED
    Bad plan.  You planned 59 tests but ran 1.
../dist/threads/t/stress_cv.t...............................FAILED
    Bad plan.  You planned 61 tests but ran 1.
../dist/threads/t/stress_re.t...............................FAILED
    Bad plan.  You planned 61 tests but ran 1.
../dist/threads/t/stress_string.t...........................FAILED
    Bad plan.  You planned 61 tests but ran 1.
../dist/threads/t/thread.t..................................FAILED
    Bad plan.  You planned 35 tests but ran 1.
../dist/threads-shared/t/waithires.t........................FAILED
    Bad plan.  You planned 63 tests but ran 0.
../ext/Hash-Util-FieldHash/t/03_class.t.....................FAILED
    Bad plan.  You planned 7 tests but ran 2.
../ext/Hash-Util-FieldHash/t/04_thread.t....................FAILED
    Bad plan.  You planned 30 tests but ran 6.
../ext/XS-APItest/t/call_checker.t..........................FAILED
    Non-zero exit status: 255
    Bad plan.  You planned 64 tests but ran 0.

[perlio] -Duseithreads -Uusemymalloc
../t/io/shm.t...............................................FAILED
    Non-zero exit status: 88
    No plan found in TAP output
../t/re/pat_thr.t...........................................FAILED
    Bad plan.  You planned 469 tests but ran 0.
../t/re/pat_advanced_thr.t..................................FAILED
    No plan found in TAP output
../t/op/threads.t...........................................FAILED
    Bad plan.  You planned 26 tests but ran 9.
../t/op/fork.t..............................................FAILED
    25
../t/op/alarm.t.............................................FAILED
    1-2
../t/op/taint.t.............................................FAILED
    Bad plan.  You planned 793 tests but ran 537.
../dist/threads-shared/t/av_refs.t..........................FAILED
    Bad plan.  You planned 14 tests but ran 3.
../dist/threads-shared/t/av_simple.t........................FAILED
    Bad plan.  You planned 44 tests but ran 9.
../dist/threads-shared/t/clone.t............................FAILED
    Bad plan.  You planned 34 tests but ran 4.
../dist/threads-shared/t/cond.t.............................FAILED
    Bad plan.  You planned 32 tests but ran 2.
../dist/threads-shared/t/hv_refs.t..........................FAILED
    Bad plan.  You planned 20 tests but ran 3.
../dist/threads-shared/t/hv_simple.t........................FAILED
    Bad plan.  You planned 16 tests but ran 2.
../dist/threads-shared/t/object2.t..........................FAILED
    Bad plan.  You planned 122 tests but ran 121.
../dist/threads-shared/t/stress.t...........................FAILED
    1
../dist/threads/t/blocks.t..................................FAILED
    Bad plan.  You planned 5 tests but ran 0.
../dist/threads/t/end.t.....................................FAILED
    Bad plan.  You planned 6 tests but ran 1.
../dist/threads/t/exit.t....................................FAILED
    11, 14-15
../dist/threads/t/join.t....................................FAILED
    Bad plan.  You planned 20 tests but ran 1.
../dist/threads/t/kill.t....................................FAILED
    No plan found in TAP output
../dist/threads/t/kill2.t...................................FAILED
    2
../dist/threads/t/libc.t....................................FAILED
    Bad plan.  You planned 11 tests but ran 1.
../dist/threads/t/list.t....................................FAILED
    Bad plan.  You planned 15 tests but ran 2.
../dist/threads/t/stack.t...................................FAILED
    Bad plan.  You planned 18 tests but ran 4.
../dist/threads/t/state.t...................................FAILED
    Bad plan.  You planned 59 tests but ran 1.
../dist/threads/t/stress_cv.t...............................FAILED
    Bad plan.  You planned 61 tests but ran 1.
../dist/threads/t/stress_string.t...........................FAILED
    Bad plan.  You planned 61 tests but ran 1.
../cpan/Time-HiRes/t/alarm.t................................FAILED
    5-6
../ext/XS-APItest/t/call_checker.t..........................FAILED
    Non-zero exit status: 255
    Bad plan.  You planned 64 tests but ran 0.
../dist/Thread-Queue/t/03_peek.t............................FAILED
    Bad plan.  You planned 19 tests but ran 1.
../dist/Thread-Queue/t/06_insert.t..........................FAILED
    Bad plan.  You planned 16 tests but ran 1.
../dist/Net-Ping/t/500_ping_icmp.t..........................FAILED
    2
    Non-zero exit status: 1
../dist/Net-Ping/t/510_ping_udp.t...........................FAILED
    2
    Non-zero exit status: 1
../cpan/Tie-RefHash/t/threaded.t............................FAILED
    Bad plan.  You planned 14 tests but ran 3.
../cpan/Win32/t/Unicode.t...................................FAILED
    4
../dist/Thread-Semaphore/t/01_basic.t.......................FAILED
    Bad plan.  You planned 10 tests but ran 2.
../dist/Thread-Semaphore/t/04_nonblocking.t.................FAILED
    Bad plan.  You planned 12 tests but ran 2.
../dist/Thread-Semaphore/t/05_force.t.......................FAILED
    Bad plan.  You planned 8 tests but ran 2.
../cpan/Win32API-File/t/file.t..............................FAILED
    Non-zero exit status: 2
    Bad plan.  You planned 267 tests but ran 49.

[stdio] -DDEBUGGING -Duseithreads -Uusemymalloc
../t/io/shm.t...............................................FAILED
    Non-zero exit status: 88
    No plan found in TAP output
../t/op/alarm.t.............................................FAILED
    4
../t/op/reset.t.............................................FAILED
    22
../t/op/substr_thr.t........................................FAILED
    Bad plan.  You planned 381 tests but ran 2.
../t/op/taint.t.............................................FAILED
    Bad plan.  You planned 793 tests but ran 537.
../t/op/threads.t...........................................FAILED
    3, 5-6
    Bad plan.  You planned 26 tests but ran 9.
../cpan/Digest-MD5/t/threads.t..............................FAILED
    Bad plan.  You planned 2 tests but ran 0.
../cpan/Time-HiRes/t/alarm.t................................FAILED
    6
    Non-zero exit status: 1
../cpan/Time-HiRes/t/ualarm.t...............................FAILED
    1, 5
    Non-zero exit status: 2
../cpan/Win32/t/Unicode.t...................................FAILED
    4
../cpan/Win32API-File/t/file.t..............................FAILED
    Non-zero exit status: 2
    Bad plan.  You planned 267 tests but ran 49.
../dist/Net-Ping/t/500_ping_icmp.t..........................FAILED
    2
    Non-zero exit status: 1
../dist/Net-Ping/t/510_ping_udp.t...........................FAILED
    2
    Non-zero exit status: 1
../dist/Thread-Queue/t/01_basic.t...........................FAILED
    Bad plan.  You planned 81 tests but ran 2.
../dist/Thread-Queue/t/02_refs.t............................FAILED
    Bad plan.  You planned 46 tests but ran 6.
../dist/Thread-Queue/t/06_insert.t..........................FAILED
    Bad plan.  You planned 16 tests but ran 1.
../dist/Thread-Semaphore/t/01_basic.t.......................FAILED
    Bad plan.  You planned 10 tests but ran 2.
../dist/Thread-Semaphore/t/05_force.t.......................FAILED
    Bad plan.  You planned 8 tests but ran 2.
../dist/Storable/t/threads.t................................FAILED
    Bad plan.  You planned 2 tests but ran 0.
../dist/threads-shared/t/av_refs.t..........................FAILED
    Bad plan.  You planned 14 tests but ran 3.
../dist/threads-shared/t/av_simple.t........................FAILED
    Bad plan.  You planned 44 tests but ran 9.
../dist/threads-shared/t/blessed.t..........................FAILED
    Bad plan.  You planned 37 tests but ran 1.
../dist/threads-shared/t/hv_refs.t..........................FAILED
    Bad plan.  You planned 20 tests but ran 3.
../dist/threads-shared/t/no_share.t.........................FAILED
    Bad plan.  You planned 6 tests but ran 3.
../dist/threads/t/basic.t...................................FAILED
    Bad plan.  You planned 34 tests but ran 2.
../dist/threads/t/blocks.t..................................FAILED
    Bad plan.  You planned 5 tests but ran 0.
../dist/threads/t/context.t.................................FAILED
    Bad plan.  You planned 31 tests but ran 1.
../dist/threads/t/end.t.....................................FAILED
    Bad plan.  You planned 6 tests but ran 1.
../dist/threads/t/err.t.....................................FAILED
    Bad plan.  You planned 10 tests but ran 1.
../dist/threads/t/exit.t....................................FAILED
    Bad plan.  You planned 18 tests but ran 1.
../dist/threads-shared/t/object2.t..........................FAILED
    Bad plan.  You planned 122 tests but ran 121.
../dist/threads-shared/t/shared_attr.t......................FAILED
    Bad plan.  You planned 101 tests but ran 2.
../dist/threads/t/free.t....................................FAILED
    Non-zero exit status: 1
    Bad plan.  You planned 29 tests but ran 1.
../dist/threads/t/free2.t...................................FAILED
    Bad plan.  You planned 78 tests but ran 0.
../dist/threads/t/join.t....................................FAILED
    Bad plan.  You planned 20 tests but ran 1.
../dist/threads/t/kill.t....................................FAILED
    No plan found in TAP output
../dist/threads-shared/t/stress.t...........................FAILED
    1
../dist/threads/t/kill2.t...................................FAILED
    No plan found in TAP output
../dist/threads/t/libc.t....................................FAILED
    Bad plan.  You planned 11 tests but ran 1.
../dist/threads/t/list.t....................................FAILED
    Bad plan.  You planned 15 tests but ran 2.
../dist/threads-shared/t/sv_refs.t..........................FAILED
    Bad plan.  You planned 21 tests but ran 6.
../dist/threads/t/problems.t................................FAILED
    Bad plan.  You planned 15 tests but ran 1.
../dist/threads-shared/t/sv_simple.t........................FAILED
    Bad plan.  You planned 11 tests but ran 3.
../dist/threads/t/stack.t...................................FAILED
    Bad plan.  You planned 18 tests but ran 4.
../dist/threads-shared/t/wait.t.............................FAILED
    Bad plan.  You planned 91 tests but ran 0.
../dist/threads/t/state.t...................................FAILED
    Bad plan.  You planned 59 tests but ran 1.
../dist/threads-shared/t/waithires.t........................FAILED
    Bad plan.  You planned 63 tests but ran 0.
../dist/threads/t/stress_cv.t...............................FAILED
    Bad plan.  You planned 61 tests but ran 1.
../dist/threads/t/stress_re.t...............................FAILED
    Bad plan.  You planned 61 tests but ran 1.
../dist/threads/t/stress_string.t...........................FAILED
    Bad plan.  You planned 61 tests but ran 1.
../ext/XS-APItest/t/call_checker.t..........................FAILED
    Non-zero exit status: 255
    Bad plan.  You planned 64 tests but ran 0.

[perlio] -DDEBUGGING -Duseithreads -Uusemymalloc
../t/io/shm.t...............................................FAILED
    Non-zero exit status: 88
    No plan found in TAP output
../t/re/regexp_qr_embed_thr.t...............................FAILED
    Bad plan.  You planned 1578 tests but ran 8.
../t/re/pat_psycho_thr.t....................................FAILED
    Bad plan.  You planned 11 tests but ran 0.
../t/re/pat_special_cc_thr.t................................FAILED
    Bad plan.  You planned 9 tests but ran 0.
../t/re/reg_email_thr.t.....................................FAILED
    No plan found in TAP output
../t/op/threads.t...........................................FAILED
    6-7, 9
    Bad plan.  You planned 26 tests but ran 9.
../t/op/taint.t.............................................FAILED
    Bad plan.  You planned 793 tests but ran 537.
../t/op/alarm.t.............................................FAILED
    1-2
../t/op/sigdispatch.t.......................................FAILED
    Bad plan.  You planned 26 tests but ran 0.
../dist/threads/t/basic.t...................................FAILED
    Bad plan.  You planned 34 tests but ran 2.
../dist/threads/t/context.t.................................FAILED
    Bad plan.  You planned 31 tests but ran 1.
../dist/threads/t/end.t.....................................FAILED
    Bad plan.  You planned 6 tests but ran 1.
../dist/threads/t/exit.t....................................FAILED
    16
../dist/threads/t/kill2.t...................................FAILED
    3
../dist/threads/t/libc.t....................................FAILED
    Bad plan.  You planned 11 tests but ran 1.
../dist/threads/t/problems.t................................FAILED
    Bad plan.  You planned 15 tests but ran 1.
../dist/threads/t/thread.t..................................FAILED
    Bad plan.  You planned 35 tests but ran 1.
../dist/threads-shared/t/av_simple.t........................FAILED
    Bad plan.  You planned 44 tests but ran 9.
../dist/threads-shared/t/hv_simple.t........................FAILED
    Bad plan.  You planned 16 tests but ran 2.
../dist/threads-shared/t/no_share.t.........................FAILED
    Bad plan.  You planned 6 tests but ran 3.
../dist/threads-shared/t/stress.t...........................FAILED
    1
../dist/threads-shared/t/sv_refs.t..........................FAILED
    Bad plan.  You planned 21 tests but ran 6.
../dist/threads-shared/t/sv_simple.t........................FAILED
    Bad plan.  You planned 11 tests but ran 3.
../dist/threads-shared/t/waithires.t........................FAILED
    Non-zero exit status: 1
    Bad plan.  You planned 63 tests but ran 55.
../cpan/Time-HiRes/t/alarm.t................................FAILED
    6
    Non-zero exit status: 1
../ext/XS-APItest/t/call_checker.t..........................FAILED
    Non-zero exit status: 255
    Bad plan.  You planned 64 tests but ran 0.
../dist/Net-Ping/t/500_ping_icmp.t..........................FAILED
    2
    Non-zero exit status: 1
../dist/Net-Ping/t/510_ping_udp.t...........................FAILED
    2
    Non-zero exit status: 1
../ext/Hash-Util-FieldHash/t/03_class.t.....................FAILED
    Bad plan.  You planned 7 tests but ran 2.
../ext/Hash-Util-FieldHash/t/04_thread.t....................FAILED
    Bad plan.  You planned 30 tests but ran 6.
../dist/Thread-Queue/t/05_extract.t.........................FAILED
    Bad plan.  You planned 20 tests but ran 1.
../dist/Thread-Queue/t/06_insert.t..........................FAILED
    Bad plan.  You planned 16 tests but ran 1.
../dist/Thread-Queue/t/07_lock.t............................FAILED
    Bad plan.  You planned 3 tests but ran 1.
../cpan/Win32/t/Unicode.t...................................FAILED
    4
../cpan/Win32API-File/t/file.t..............................FAILED
    Non-zero exit status: 2
    Bad plan.  You planned 267 tests but ran 49.
../dist/Thread-Semaphore/t/01_basic.t.......................FAILED
    Bad plan.  You planned 10 tests but ran 2.
../cpan/Digest-MD5/t/threads.t..............................FAILED
    Bad plan.  You planned 2 tests but ran 0.

Passed Todo tests: (common-args) -Dcc='ccache gcc'
[stdio] -Uusethreads -Uuseithreads
[stdio] -DDEBUGGING -Uusethreads -Uuseithreads
[stdio] -Duseithreads -Uusemymalloc
[stdio] -DDEBUGGING -Duseithreads -Uusemymalloc
../t/io/tell.t..............................................PASSED
    28
../cpan/CGI/t/tmpdir.t......................................PASSED
    3-9
../lib/File/Compare.t.......................................PASSED
    13
../lib/File/Copy.t..........................................PASSED
    77-78, 83-84, 89-90, 95-96, 101-102, 107-108
    113-114, 119-120, 125-126, 131-132, 137-138
    143-144, 149-150, 155-156, 161-162, 167-168
    173-174, 179-180, 185-186, 191-192, 197-198
    203-204, 209-210, 215-216, 221-222, 227-228
    233-234, 239-240, 245-246, 251-252, 257-258
    263-264, 269-270, 275-276, 281-282, 287-288
    293-294, 299-300, 305-306, 311-312, 317-318
    323-324, 329-330, 335-336, 341-342, 347-348
    353-354, 359-360, 365-366, 371-372, 377-378
    383-384, 389-390, 395-396, 401-402, 407-408

[perlio] -Uusethreads -Uuseithreads
[perlio] -DDEBUGGING -Uusethreads -Uuseithreads
[perlio] -Duseithreads -Uusemymalloc
[perlio] -DDEBUGGING -Duseithreads -Uusemymalloc
../lib/File/Compare.t.......................................PASSED
    13
../lib/File/Copy.t..........................................PASSED
    77-78, 83-84, 89-90, 95-96, 101-102, 107-108
    113-114, 119-120, 125-126, 131-132, 137-138
    143-144, 149-150, 155-156, 161-162, 167-168
    173-174, 179-180, 185-186, 191-192, 197-198
    203-204, 209-210, 215-216, 221-222, 227-228
    233-234, 239-240, 245-246, 251-252, 257-258
    263-264, 269-270, 275-276, 281-282, 287-288
    293-294, 299-300, 305-306, 311-312, 317-318
    323-324, 329-330, 335-336, 341-342, 347-348
    353-354, 359-360, 365-366, 371-372, 377-378
    383-384, 389-390, 395-396, 401-402, 407-408
../cpan/CGI/t/tmpdir.t......................................PASSED
    3-9

Compiler messages(gcc):
regcomp.c: In function ‘S_regclass’:
regcomp.c:10851:415: warning: ignoring return value of ‘get_regex_charset’, declared with attribute warn_unused_result
doio.c: In function ‘Perl_do_msgsnd’:
doio.c:2150:23: warning: defining a type in a cast is invalid in C++
doio.c: In function ‘Perl_do_msgrcv’:
doio.c:2183:22: warning: defining a type in a cast is invalid in C++
perlio.c: In function ‘PerlIOStdio_set_ptrcnt’:
perlio.c:3577:17: warning: pointer targets in assignment differ in signedness
cygwin.c: In function ‘do_spawn’:
cygwin.c:132:14: warning: assignment from incompatible pointer type
cygwin.c: In function ‘XS_Cygwin_posix_to_win_path’:
cygwin.c:346:9: warning: ‘err’ may be used uninitialized in this function
cygwin.c: In function ‘XS_Cygwin_win_to_posix_path’:
cygwin.c:257:9: warning: ‘err’ may be used uninitialized in this function
POSIX.xs:81:7: warning: ‘_tzname’ redeclared without dllimport attribute: previous dllimport ignored
re_comp.c: In function ‘S_regclass’:
re_comp.c:10851:415: warning: ignoring return value of ‘get_regex_charset’, declared with attribute warn_unused_result
regcomp.c:10851:431: warning: ignoring return value of ‘get_regex_charset’, declared with attribute warn_unused_result
cygwin.c:132:23: warning: assignment from incompatible pointer type
re_comp.c:10851:431: warning: ignoring return value of ‘get_regex_charset’, declared with attribute warn_unused_result

-- 
Report by Test::Smoke v1.44 build 1285 running on perl 5.10.1
(Reporter v0.035 / Smoker v0.045)

Logs at http://perl.develop-help.com/reports/
Branch: remotes/origin/smoke-me/tweak-run-tests
Configuration: default




nntp.perl.org: Perl Programming lists via nntp and http.
Comments to Ask Bjørn Hansen at ask@perl.org | Group listing | About