develooper Front page | perl.daily-build.reports | Postings from February 2012

Smoke [5.15.8] v5.15.8-47-g55d3f3e FAIL(FM) netbsd 5.1 (amd64/6 cpu)

From:
tony
Date:
February 27, 2012 05:32
Subject:
Smoke [5.15.8] v5.15.8-47-g55d3f3e FAIL(FM) netbsd 5.1 (amd64/6 cpu)
Message ID:
201202271331.q1RDVm6I023820@mars.tony.develop-help.com
Automated smoke report for 5.15.8 patch 55d3f3e53492b8cc2dcf2c5ff35f6b379b1685e8 v5.15.8-47-g55d3f3e
deimos.tony.develop-help.com: AMD 686-class (amd64/6 cpu)
    on        netbsd - 5.1
    using     cc version 4.1.3 20080704 prerelease (NetBSD nb2 20081120)
    smoketime 1 hour 46 minutes (average 8 minutes 52 seconds)

Summary: FAIL(FM)

O = OK  F = Failure(s), extended report at the bottom
X = Failure(s) under TEST but not under harness
? = still running or test results not (yet) available
Build failures during:       - = unknown or N/A
c = Configure, m = make, M = make (after miniperl), t = make test-prep

v5.15.8-47-g55d3f3e  Configuration (common) none
----------- ---------------------------------------------------------
M - M -     
M - M -     -Duse64bitint
O O O O     -Dmad
O O F F     -Duseithreads
O F O O     -Duseithreads -Duse64bitint
O O O O     -Duseithreads -Dmad
| | | +----- PERLIO = perlio -DDEBUGGING
| | +------- PERLIO = stdio  -DDEBUGGING
| +--------- PERLIO = perlio
+----------- PERLIO = stdio


Locally applied patches:
    uncommitted-changes
    SMOKE55d3f3e53492b8cc2dcf2c5ff35f6b379b1685e8

Testsuite was run only with 'harness' and HARNESS_OPTIONS=j4

Failures: (common-args) none
[minitest] 
[minitest] -DDEBUGGING
[minitest] -Duse64bitint
[minitest] -DDEBUGGING -Duse64bitint
    t/comp/require ................. FAILED at test 50
    t/re/regexp .................... FAILED--expected 1578 tests, saw 1563
    t/re/regexp_noamp .............. FAILED--expected 1578 tests, saw 1563
    t/re/regexp_notrie ............. FAILED--expected 1578 tests, saw 1563
    t/re/regexp_qr ................. FAILED--expected 1578 tests, saw 1563
    t/re/regexp_qr_embed ........... FAILED--expected 1578 tests, saw 1563
    t/re/regexp_trielist ........... FAILED--expected 1578 tests, saw 1563
    t/op/eval ...................... FAILED at test 124

[stdio] -DDEBUGGING -Duseithreads
../cpan/Memoize/t/tie_sdbm.t................................FAILED
    Non-zero exit status: 1
    No plan found in TAP output
../ext/SDBM_File/t/sdbm.t...................................FAILED
    Non-zero exit status: 1
    No plan found in TAP output
../lib/DBM_Filter/t/02core.t................................FAILED
    Non-zero exit status: 1
    Bad plan.  You planned 189 tests but ran 4.
../lib/DBM_Filter/t/compress.t..............................FAILED
    Non-zero exit status: 1
    Bad plan.  You planned 23 tests but ran 8.
../lib/DBM_Filter/t/encode.t................................FAILED
    Non-zero exit status: 1
    Bad plan.  You planned 26 tests but ran 10.
../lib/DBM_Filter/t/int32.t.................................FAILED
    Non-zero exit status: 1
    Bad plan.  You planned 22 tests but ran 7.
../lib/DBM_Filter/t/null.t..................................FAILED
    Non-zero exit status: 1
    Bad plan.  You planned 26 tests but ran 7.
../lib/DBM_Filter/t/utf8.t..................................FAILED
    Non-zero exit status: 1
    Bad plan.  You planned 20 tests but ran 9.

[perlio] -DDEBUGGING -Duseithreads
../cpan/Memoize/t/tie_sdbm.t................................FAILED
    Non-zero exit status: 1
    No plan found in TAP output
../lib/Benchmark.t..........................................FAILED
    129
    Non-zero exit status: 1
../lib/DBM_Filter/t/02core.t................................FAILED
    Non-zero exit status: 1
    Bad plan.  You planned 189 tests but ran 4.
../lib/DBM_Filter/t/compress.t..............................FAILED
    Non-zero exit status: 1
    Bad plan.  You planned 23 tests but ran 8.
../lib/DBM_Filter/t/encode.t................................FAILED
    Non-zero exit status: 1
    Bad plan.  You planned 26 tests but ran 10.
../lib/DBM_Filter/t/int32.t.................................FAILED
    Non-zero exit status: 1
    Bad plan.  You planned 22 tests but ran 7.
../lib/DBM_Filter/t/null.t..................................FAILED
    Non-zero exit status: 1
    Bad plan.  You planned 26 tests but ran 7.
../lib/DBM_Filter/t/utf8.t..................................FAILED
    Non-zero exit status: 1
    Bad plan.  You planned 20 tests but ran 9.
../ext/SDBM_File/t/sdbm.t...................................FAILED
    Non-zero exit status: 1
    No plan found in TAP output

[perlio] -Duseithreads -Duse64bitint
../lib/Benchmark.t..........................................FAILED
    129
    Non-zero exit status: 1

Passed Todo tests: (common-args) none
[stdio/perlio] -Dmad
[stdio/perlio] -DDEBUGGING -Dmad
[stdio/perlio] -Duseithreads
[stdio/perlio] -DDEBUGGING -Duseithreads
[stdio/perlio] -Duseithreads -Duse64bitint
[stdio/perlio] -DDEBUGGING -Duseithreads -Duse64bitint
[stdio/perlio] -Duseithreads -Dmad
[stdio/perlio] -DDEBUGGING -Duseithreads -Dmad
../cpan/CGI/t/tmpdir.t......................................PASSED
    3-9

Compiler messages(gcc):
try.c: In function 'main':
try.c:23: error: 'KERN_PROC_PATHNAME' undeclared (first use in this function)
try.c:23: error: (Each undeclared identifier is reported only once
try.c:23: error: for each function it appears in.)
try.c:4:25: error: mach-o/dyld.h: No such file or directory
regcomp.c: In function 'S_regclass':
regcomp.c:10851: warning: ignoring return value of 'get_regex_charset', declared with attribute warn_unused_result
perlio.c: In function 'PerlIOStdio_set_ptrcnt':
perlio.c:3577: warning: pointer targets in assignment differ in signedness

-- 
Report by Test::Smoke v1.44 build 1285 running on perl 5.12.2
(Reporter v0.035 / Smoker v0.045)

Logs at http://perl.develop-help.com/reports/
Branch: origin/blead
Configuration: default




nntp.perl.org: Perl Programming lists via nntp and http.
Comments to Ask Bjørn Hansen at ask@perl.org | Group listing | About