develooper Front page | perl.daily-build.reports | Postings from February 2012

Smoke [5.15.8] v5.15.8-37-g2eb7c4e PASS darwin 10.8.0 (Intel Core 2 Duo/1 cpu[2 cores])

Thread Next
From:
tony
Date:
February 27, 2012 04:25
Subject:
Smoke [5.15.8] v5.15.8-37-g2eb7c4e PASS darwin 10.8.0 (Intel Core 2 Duo/1 cpu[2 cores])
Message ID:
201202271224.q1RCOsZC019527@mars.tony.develop-help.com
Automated smoke report for 5.15.8 patch 2eb7c4e6ddc7bf8dad1d568547a4d021d70278e8 v5.15.8-37-g2eb7c4e
neptune.local: iMac (2.4 GHz) (Intel Core 2 Duo/1 cpu[2 cores])
    on        darwin - 10.8.0 (Mac OS X)
    using     cc version 4.2.1 (Apple Inc. build 5646)
    smoketime 5 hours 19 minutes (average 19 minutes 60 seconds)

Summary: PASS

O = OK  F = Failure(s), extended report at the bottom
X = Failure(s) under TEST but not under harness
? = still running or test results not (yet) available
Build failures during:       - = unknown or N/A
c = Configure, m = make, M = make (after miniperl), t = make test-prep

v5.15.8-37-g2eb7c4e  Configuration (common) none
----------- ---------------------------------------------------------
O O O O     
O O O O     -Duse64bitint
O O O O     -Dusedtrace
O O O O     -Dusemorebits
O O O O     -Duseithreads
O O O O     -Duseithreads -Duse64bitint
O O O O     -Duseithreads -Dusedtrace
O O O O     -Duseithreads -Dusemorebits
| | | +----- PERLIO = perlio -DDEBUGGING
| | +------- PERLIO = stdio  -DDEBUGGING
| +--------- PERLIO = perlio
+----------- PERLIO = stdio


Locally applied patches:
    uncommitted-changes
    SMOKE2eb7c4e6ddc7bf8dad1d568547a4d021d70278e8

Testsuite was run only with 'harness' and HARNESS_OPTIONS=j3

Passed Todo tests: (common-args) none
[stdio/perlio] 
[stdio/perlio] -DDEBUGGING
[stdio/perlio] -Duse64bitint
[stdio/perlio] -DDEBUGGING -Duse64bitint
[stdio/perlio] -Dusedtrace
[stdio/perlio] -DDEBUGGING -Dusedtrace
[stdio/perlio] -Dusemorebits
[stdio/perlio] -DDEBUGGING -Dusemorebits
[stdio/perlio] -Duseithreads
[stdio/perlio] -DDEBUGGING -Duseithreads
[stdio/perlio] -Duseithreads -Duse64bitint
[stdio/perlio] -DDEBUGGING -Duseithreads -Duse64bitint
[stdio/perlio] -Duseithreads -Dusedtrace
[stdio/perlio] -DDEBUGGING -Duseithreads -Dusedtrace
[stdio/perlio] -Duseithreads -Dusemorebits
[stdio/perlio] -DDEBUGGING -Duseithreads -Dusemorebits
../cpan/CGI/t/tmpdir.t......................................PASSED
    3-9

Compiler messages(gcc):
try.c: In function 'main':
try.c:23: error: 'KERN_PROC_PATHNAME' undeclared (first use in this function)
try.c:23: error: (Each undeclared identifier is reported only once
try.c:23: error: for each function it appears in.)
regcomp.c: In function 'S_regclass':
regcomp.c:10851: warning: ignoring return value of 'get_regex_charset', declared with attribute warn_unused_result
perlio.c: In function 'PerlIOStdio_set_ptrcnt':
perlio.c:3577: warning: pointer targets in assignment differ in signedness
Call.xs: In function 'filter_call':
Call.xs:63: warning: format '%d' expects type 'int', but argument 3 has type 'STRLEN'
Call.xs:63: warning: format '%d' expects type 'int', but argument 5 has type 'STRLEN'
Call.xs:100: warning: format '%d' expects type 'int', but argument 4 has type 'STRLEN'
Call.xs:156: warning: format '%d' expects type 'int', but argument 3 has type 'STRLEN'
Call.xs:175: warning: format '%d' expects type 'int', but argument 4 has type 'STRLEN'
re_comp.c: In function 'S_regclass':
re_comp.c:10851: warning: ignoring return value of 'get_regex_charset', declared with attribute warn_unused_result

-- 
Report by Test::Smoke v1.43 build 1271 running on perl 5.10.0
(Reporter v0.035 / Smoker v0.045)

Logs at http://perl.develop-help.com/reports/
Branch: remotes/origin/smoke-me/portabilify-podhtml
Configuration: default


Thread Next


nntp.perl.org: Perl Programming lists via nntp and http.
Comments to Ask Bjørn Hansen at ask@perl.org | Group listing | About