develooper Front page | perl.daily-build.reports | Postings from February 2012

Smoke [5.15.8] v5.15.8-33-gf828ccb FAIL(X) mirbsd 10 (i386/1 cpu)

From:
Steven Schubiger
Date:
February 26, 2012 22:53
Subject:
Smoke [5.15.8] v5.15.8-33-gf828ccb FAIL(X) mirbsd 10 (i386/1 cpu)
Message ID:
20120227065314.6512A1760077@schubiger.nine.ch
Automated smoke report for 5.15.8 patch f828ccba708aa823170a00f5a5fb04a26c9283af v5.15.8-33-gf828ccb
eurynome.mirbsd.org: AMD Phenom(tm) 9550 Quad-Core Processor ("AuthenticAMD" 686-class, 512KB L2 cache) (2009 MHz) (i386/1 cpu)
    on        mirbsd - 10
    using     mgcc version 3.4.6 (propolice; gpc; MirOS 0AAB)
    smoketime 1 day 51 minutes (average 3 hours 6 minutes)

Summary: FAIL(X)

O = OK  F = Failure(s), extended report at the bottom
X = Failure(s) under TEST but not under harness
? = still running or test results not (yet) available
Build failures during:       - = unknown or N/A
c = Configure, m = make, M = make (after miniperl), t = make test-prep

v5.15.8-33-gf828ccb  Configuration (common) none
----------- ---------------------------------------------------------
X X X X     
X X X X     -Duse64bitint
X X X X     -Duseithreads
X X X X     -Duseithreads -Duse64bitint
| | | +----- PERLIO = perlio -DDEBUGGING
| | +------- PERLIO = stdio  -DDEBUGGING
| +--------- PERLIO = perlio
+----------- PERLIO = stdio


Locally applied patches:
    uncommitted-changes
    SMOKEf828ccba708aa823170a00f5a5fb04a26c9283af

Failures: (common-args) none
[stdio/perlio] 
[stdio/perlio] -DDEBUGGING
[stdio/perlio] -Duse64bitint
[stdio/perlio] -DDEBUGGING -Duse64bitint
Inconsistent test results (between TEST and harness):
    ../t/op/sprintf.t....................... .................................................. FAILED at test 230
    ../lib/version/t/07locale.t............. ........................................ FAILED at test 3
    ../ext/DynaLoader/t/DynaLoader.t........ ................................... FAILED at test 20
    ../t/dist/Net-Ping/t/450_service.t...... ................................... FAILED at test 9
    ../t/cpan/Time-Local/t/Local.t.......... ....................................... FAILED at test 138

[stdio] -Duseithreads
Inconsistent test results (between TEST and harness):
    ../t/io/errno.t......................... .................................................... FAILED at test 9
    ../t/op/sprintf.t....................... .................................................. FAILED at test 230
    ../lib/version/t/07locale.t............. ........................................ FAILED at test 3
    ../ext/DynaLoader/t/DynaLoader.t........ ................................... FAILED at test 20
    ../t/op/sigdispatch.t................... .............................................. FAILED--expected 26 tests, saw 0
    ../t/dist/Net-Ping/t/450_service.t...... ................................... FAILED at test 9
    ../t/cpan/Time-Local/t/Local.t.......... ....................................... FAILED at test 138
    ../t/cpan/Time-HiRes/t/alarm.t.......... ....................................... FAILED at test 2

[perlio] -Duseithreads
[perlio] -Duseithreads -Duse64bitint
Inconsistent test results (between TEST and harness):
    ../t/io/errno.t......................... .................................................... FAILED at test 9
    ../t/op/sprintf.t....................... .................................................. FAILED at test 230
    ../lib/version/t/07locale.t............. ........................................ FAILED at test 3
    ../ext/DynaLoader/t/DynaLoader.t........ ................................... FAILED at test 20
    ../t/op/sigdispatch.t................... .............................................. FAILED--expected 26 tests, saw 0
    ../t/dist/Net-Ping/t/450_service.t...... ................................... FAILED at test 9
    ../t/cpan/Time-Local/t/Local.t.......... ....................................... FAILED at test 138

[stdio] -DDEBUGGING -Duseithreads
Inconsistent test results (between TEST and harness):
    ../t/io/errno.t......................... .................................................... FAILED at test 10
    ../t/op/sprintf.t....................... .................................................. FAILED at test 230
    ../lib/version/t/07locale.t............. ........................................ FAILED at test 3
    ../ext/DynaLoader/t/DynaLoader.t........ ................................... FAILED at test 20
    ../t/op/sigdispatch.t................... .............................................. FAILED--expected 26 tests, saw 0
    ../t/dist/Net-Ping/t/450_service.t...... ................................... FAILED at test 9
    ../t/cpan/Time-Local/t/Local.t.......... ....................................... FAILED at test 138
    ../t/cpan/Time-HiRes/t/alarm.t.......... ....................................... FAILED at test 2

[perlio] -DDEBUGGING -Duseithreads
[stdio] -Duseithreads -Duse64bitint
[stdio/perlio] -DDEBUGGING -Duseithreads -Duse64bitint
Inconsistent test results (between TEST and harness):
    ../t/io/errno.t......................... .................................................... FAILED at test 10
    ../t/op/sprintf.t....................... .................................................. FAILED at test 230
    ../lib/version/t/07locale.t............. ........................................ FAILED at test 3
    ../ext/DynaLoader/t/DynaLoader.t........ ................................... FAILED at test 20
    ../t/op/sigdispatch.t................... .............................................. FAILED--expected 26 tests, saw 0
    ../t/dist/Net-Ping/t/450_service.t...... ................................... FAILED at test 9
    ../t/cpan/Time-Local/t/Local.t.......... ....................................... FAILED at test 138

Compiler messages(gcc):
/tmp//ccVB2656.o: In function `main':
/tmp//ccV22684.o: In function `main':
/tmp//cciR6166.o: In function `xxx':
/tmp//ccQM3632.o: In function `main':
/usr/include/sys/ucred.h:46: error: `NGROUPS' undeclared here (not in a function)
/usr/include/sys/proc.h:57: error: `MAXLOGNAME' undeclared here (not in a function)
/usr/include/sys/proc.h:83: error: syntax error before "int"
/usr/include/sys/proc.h:200: error: syntax error before "sigset_t"
/usr/include/sys/proc.h:207: error: `MAXCOMLEN' undeclared here (not in a function)
try.c: In function `main':
try.c:23: error: `KERN_PROC_PATHNAME' undeclared (first use in this function)
try.c:23: error: (Each undeclared identifier is reported only once
try.c:23: error: for each function it appears in.)
op_reg_common.h: In function `S_regclass':
regcomp.c:10851: warning: ignoring return value of `get_regex_charset', declared with attribute warn_unused_result
regcomp.o: In function `S_regclass':
libperl.a(regcomp.o): In function `S_regclass':
<command line>:9:1: warning: "TIME_HIRES_STAT" redefined
<command line>:8:1: warning: this is the location of the previous definition
../../op_reg_common.h: In function `S_regclass':
re_comp.c:10851: warning: ignoring return value of `get_regex_charset', declared with attribute warn_unused_result
util.o: In function `savestr':
str.o: In function `str_2ptr':
../libperl.a(sv.o): In function `Perl_sv_vcatpvfn':
/tmp//ccK22132.o: In function `main':
/home/stsc/source/p5-current/UU/try.c:20: warning: strcpy() is almost always misused, consider using strlcpy()
/tmp//ccpB5880.o: In function `main':
/home/stsc/source/p5-current/UU/try.c:29: warning: strcpy() is almost always misused, consider using strlcpy()
/tmp//cczc6238.o: In function `xxx':
/home/stsc/source/p5-current/UU/try.c:29: warning: vsprintf() is often misused, consider using vsnprintf()
/tmp//ccXn5960.o: In function `main':
/home/stsc/source/p5-current/UU/try.c:52: warning: sprintf() is often misused, consider using snprintf()
/home/stsc/source/p5-current/regcomp.c:10578: warning: sprintf() is often misused, consider using snprintf()
<command line>:11:1: warning: "TIME_HIRES_STAT" redefined
<command line>:10:1: warning: this is the location of the previous definition
/home/stsc/source/p5-current/x2p/util.c:147: warning: strcpy() is almost always misused, consider using strlcpy()
/home/stsc/source/p5-current/x2p/str.c:32: warning: sprintf() is often misused, consider using snprintf()
/home/stsc/source/p5-current/sv.c:10977: warning: sprintf() is often misused, consider using snprintf()
/tmp//ccp22802.o: In function `main':
/tmp//ccm16350.o: In function `main':
/tmp//ccmGFB38.o: In function `xxx':
/tmp//ccz26600.o: In function `main':
/tmp//ccPB3429.o: In function `main':
/tmp//ccUT2649.o: In function `main':
/tmp//ccJ31195.o: In function `xxx':
/tmp//ccd10452.o: In function `main':
/tmp//ccZ26958.o: In function `main':
/tmp//ccD20012.o: In function `main':
/tmp//cco13074.o: In function `xxx':
/tmp//ccd22289.o: In function `main':
<command line>:10:1: warning: "TIME_HIRES_STAT" redefined
<command line>:9:1: warning: this is the location of the previous definition
/tmp//ccz16541.o: In function `main':
/tmp//ccV21730.o: In function `main':
/tmp//ccGv1007.o: In function `xxx':
/tmp//ccK15504.o: In function `main':
<command line>:12:1: warning: "TIME_HIRES_STAT" redefined
<command line>:11:1: warning: this is the location of the previous definition
/tmp//ccSk2140.o: In function `main':
/tmp//ccB25876.o: In function `main':
/tmp//cccp5880.o: In function `xxx':
/tmp//ccr27943.o: In function `main':
/tmp//ccg30265.o: In function `main':
/tmp//ccV10710.o: In function `main':
/tmp//ccd30882.o: In function `xxx':
/tmp//ccY18779.o: In function `main':

-- 
Report by Test::Smoke v1.44 build 1285 running on perl 5.8.8
(Reporter v0.035 / Smoker v0.045)



nntp.perl.org: Perl Programming lists via nntp and http.
Comments to Ask Bjørn Hansen at ask@perl.org | Group listing | About