develooper Front page | perl.daily-build.reports | Postings from February 2012

Smoke [5.15.8] v5.15.8-37-ga892b81 FAIL(F) netbsd 5.1 (amd64/6 cpu)

From:
tony
Date:
February 26, 2012 21:11
Subject:
Smoke [5.15.8] v5.15.8-37-ga892b81 FAIL(F) netbsd 5.1 (amd64/6 cpu)
Message ID:
201202270510.q1R5AZGV008217@mars.tony.develop-help.com
Automated smoke report for 5.15.8 patch a892b81a8ad64d2a842be6138a2983f4b7c315df v5.15.8-37-ga892b81
deimos.tony.develop-help.com: AMD 686-class (amd64/6 cpu)
    on        netbsd - 5.1
    using     cc version 4.1.3 20080704 prerelease (NetBSD nb2 20081120)
    smoketime 2 hours 10 minutes (average 10 minutes 53 seconds)

Summary: FAIL(F)

O = OK  F = Failure(s), extended report at the bottom
X = Failure(s) under TEST but not under harness
? = still running or test results not (yet) available
Build failures during:       - = unknown or N/A
c = Configure, m = make, M = make (after miniperl), t = make test-prep

v5.15.8-37-ga892b81  Configuration (common) none
----------- ---------------------------------------------------------
O O F O     
O O F O     -Duse64bitint
O O O O     -Dmad
O O O F     -Duseithreads
O O O O     -Duseithreads -Duse64bitint
O O O O     -Duseithreads -Dmad
| | | +----- PERLIO = perlio -DDEBUGGING
| | +------- PERLIO = stdio  -DDEBUGGING
| +--------- PERLIO = perlio
+----------- PERLIO = stdio


Locally applied patches:
    uncommitted-changes
    SMOKEa892b81a8ad64d2a842be6138a2983f4b7c315df

Testsuite was run only with 'harness' and HARNESS_OPTIONS=j4

Failures: (common-args) none
[stdio] -DDEBUGGING
[stdio] -DDEBUGGING -Duse64bitint
[perlio] -DDEBUGGING -Duseithreads
../lib/Benchmark.t..........................................FAILED
    129
    Non-zero exit status: 1

Passed Todo tests: (common-args) none
[stdio/perlio] 
[stdio/perlio] -DDEBUGGING
[stdio/perlio] -Duse64bitint
[stdio/perlio] -DDEBUGGING -Duse64bitint
[stdio/perlio] -Dmad
[stdio/perlio] -DDEBUGGING -Dmad
[stdio/perlio] -Duseithreads
[stdio/perlio] -DDEBUGGING -Duseithreads
[stdio/perlio] -Duseithreads -Duse64bitint
[stdio/perlio] -DDEBUGGING -Duseithreads -Duse64bitint
[stdio/perlio] -Duseithreads -Dmad
[stdio/perlio] -DDEBUGGING -Duseithreads -Dmad
../cpan/CGI/t/tmpdir.t......................................PASSED
    3-9

Compiler messages(gcc):
try.c: In function 'main':
try.c:23: error: 'KERN_PROC_PATHNAME' undeclared (first use in this function)
try.c:23: error: (Each undeclared identifier is reported only once
try.c:23: error: for each function it appears in.)
try.c:4:25: error: mach-o/dyld.h: No such file or directory

-- 
Report by Test::Smoke v1.44 build 1285 running on perl 5.12.2
(Reporter v0.035 / Smoker v0.045)

Logs at http://perl.develop-help.com/reports/
Branch: origin/blead
Configuration: default




nntp.perl.org: Perl Programming lists via nntp and http.
Comments to Ask Bjørn Hansen at ask@perl.org | Group listing | About